[cyber] I: Sisyphus-20221222 x86_64 beehive_status: +37 -3 (101)

ALT beekeeper hiver altlinux.org
22 11:10:27 MSK 2022


	37 NEW error logs

NetworkManager-1.40.8-alt1
	src/nm-cloud-setup/nm-http-client.c: In function 'nm_http_client_get':
	src/nm-cloud-setup/nm-http-client.c:308:5: error: 'CURLOPT_PROTOCOLS' is deprecated:
	since 7.85.0. Use CURLOPT_PROTOCOLS_STR [-Werror=deprecated-declarations]
	308 |	  curl_easy_setopt(edata->ehandle, CURLOPT_PROTOCOLS, CURLPROTO_HTTP |
	CURLPROTO_HTTPS);
	--
	1749 |	 CURLOPTDEPRECATED(CURLOPT_PROTOCOLS, CURLOPTTYPE_LONG, 181,
	cc1: all warnings being treated as errors
	make[2]: *** [Makefile:13034: src/nm-cloud-setup/libnm_cloud_setup_core_a-nm-http-client.o]
	Error 1

bamf-0.5.6-alt1
	/bin/dbus-run-session -- make  -k test;
	dbus-daemon[832781]: Failed to start message bus: Failed to bind socket
	"/run/dbus/users/dbus-Vmrb6GEtXy": No such file or directory
	dbus-run-session: EOF reading address from bus daemon

basu-0.2.0-alt2
	+ dbus-run-session -- ninja-build -C x86_64-alt-linux test
	dbus-daemon[3082936]: Failed to start message bus: Failed to bind socket
	"/run/dbus/users/dbus-0QQ7TypGqC": No such file or directory
	dbus-run-session: EOF reading address from bus daemon

certmonger-0.79.17-alt1
	./run-tests.sh 001-keyiread 001-keyiread-rsa 002-keygen-rsa 003-csrgen 003-csrgen-rsa
	004-selfsign 004-selfsign-rsa 005-dbusm 006-serial 008-certread 009-oiddict 010-iterate
	014-prefs 016-dates 018-pembase 019-dparse 021-resume 022-base64 023-cadata 024-citerate
	026-local 027-hooks 028-dbus 029-canonize 030-rekey 031-pkcs7 032-chain 033-scep
	035-json 036-getcert 037-rekey2 038-ms-v2-template 039-fromfile 040-pem 002-keygen-dbm
	007-certsave-dbm 011-dbinit-dbm 012-dbadd-dbm 013-enckey-dbm 015-lockedkey-dbm
	017-notoken-dbm 025-casave-dbm 034-perms-dbm 002-keygen-sql 007-certsave-sql 011-dbinit-sql
	012-dbadd-sql 013-enckey-sql 015-lockedkey-sql 017-notoken-sql 025-casave-sql 034-perms-sql
	001-keyiread-ec 002-keygen-ec 003-csrgen-ec 004-selfsign-ec
	dbus-daemon[835757]: Failed to start message bus: Failed to bind socket
	"/run/dbus/users/dbus-MhyrFJfH6L": No such file or directory
	<28>Dec 22 00:04:33 dbus-daemon[835757]: Failed to start message bus: Failed to bind
	socket "/run/dbus/users/dbus-MhyrFJfH6L": No such file or directory
	EOF in dbus-launch reading address from bus daemon

cockpit-280.1-alt1
	FAIL test-webservice (exit status: 133)
	FAIL: test-authssh
	# random seed: R02Sce186143f71c9655a6a4c6bdeac4aeaa
	--
	# SKIP:  0
	# XFAIL: 0
	# FAIL:  5
	# XPASS: 0
	# ERROR: 0
	See ./test-suite.log

elfutils-0.188-alt1
	../../debuginfod/debuginfod-client.c: In function 'debuginfod_query_server':
	../../debuginfod/debuginfod-client.c:1330:7: error: 'CURLOPT_PROTOCOLS' is deprecated:
	since 7.85.0. Use CURLOPT_PROTOCOLS_STR [-Werror=deprecated-declarations]
	1330 |	     curl_easy_setopt_ck(data[i].handle, CURLOPT_PROTOCOLS,
	--
	1749 |	 CURLOPTDEPRECATED(CURLOPT_PROTOCOLS, CURLOPTTYPE_LONG, 181,
	../../debuginfod/debuginfod-client.c:1468:11: error: 'CURLINFO_CONTENT_LENGTH_DOWNLOAD'
	is deprecated: since 7.55.0. Use CURLINFO_CONTENT_LENGTH_DOWNLOAD_T
	[-Werror=deprecated-declarations]
	1468 |		 curl_res = curl_easy_getinfo(target_handle,
	--
	2853 |	 CURLINFO_CONTENT_LENGTH_DOWNLOAD
	../../debuginfod/debuginfod-client.c:1503:15: error: 'CURLINFO_SIZE_DOWNLOAD' is
	deprecated: since 7.55.0. Use CURLINFO_SIZE_DOWNLOAD_T [-Werror=deprecated-declarations]
	1503 |		     curl_res = curl_easy_getinfo(target_handle,
	--
	2836 |	 CURLINFO_SIZE_DOWNLOAD
	cc1: all warnings being treated as errors
	make[2]: *** [Makefile:632: debuginfod-client.o] Error 1

fleet-commander-admin-0.15.1-alt11
	PASS: test_mergers.py
	<28>Dec 22 03:17:46 dbus-daemon[1622434]: Failed to start message bus: Failed to bind
	socket "/run/dbus/users/dbus-7XuvIJPYlT": No such file or directory
	<28>Dec 22 03:17:46 dbus-daemon[1622491]: Failed to start message bus: Failed to bind
	socket "/run/dbus/users/dbus-ZLi0n79CRo": No such file or directory
	FAIL: test_logger_dconf.sh
	PASS: test_logger_connmgr.py
	<28>Dec 22 03:17:46 dbus-daemon[1623100]: Failed to start message bus: Failed to bind
	socket "/run/dbus/users/dbus-Iys1OPgtrv": No such file or directory
	FAIL: test_logger_nm.sh
	PASS: test_logger_chromium.py
	--
	PASS: test_libvirt_controller.py
	<28>Dec 22 03:17:48 dbus-daemon[1627168]: Failed to start message bus: Failed to bind
	socket "/run/dbus/users/dbus-gf3r2xwfvH": No such file or directory
	FAIL: test_fcdbus.sh
	fleet-commander-admin 0.15.1: tests/test-suite.log
	--
	# SKIP:  0
	# XFAIL: 0
	# FAIL:  3
	# XPASS: 0
	# ERROR: 0
	.. contents:: :depth: 2

fleet-commander-client-0.15.0-alt4
	PASS: 16_adapter_firefoxbookmarks.py
	<28>Dec 22 03:17:47 dbus-daemon[512534]: Failed to start message bus: Failed to bind
	socket "/run/dbus/users/dbus-V66dTJ0tEe": No such file or directory
	FAIL: 17_fcclientad.sh
	Testsuite summary for fleet-commander-client 0.15.0
	--
	# SKIP:  0
	# XFAIL: 0
	# FAIL:  1
	# XPASS: 0
	# ERROR: 0
	See tests/test-suite.log
	--
	# SKIP:  0
	# XFAIL: 0
	# FAIL:  1
	# XPASS: 0
	# ERROR: 0
	.. contents:: :depth: 2
	FAIL: 17_fcclientad.sh
	dbus-daemon[512534]: Failed to start message bus: Failed to bind socket
	"/run/dbus/users/dbus-V66dTJ0tEe": No such file or directory
	EOF in dbus-launch reading address from bus daemon

fprintd-1.94.2-alt1
	Full log written to
	/usr/src/RPM/BUILD/fprintd-1.94.2/x86_64-alt-linux/meson-logs/testlog.txt
	FAILED: meson-internal__test
	/usr/bin/meson test --no-rebuild --print-errorlogs

freelan-2.3-alt3
	build/release/libs/freelan/src/curl.cpp: In member function ‘ptrdiff_t
	freelan::curl::get_content_length_download()’:
	build/release/libs/freelan/src/curl.cpp:352:69: error:
	‘CURLINFO_CONTENT_LENGTH_DOWNLOAD’ is deprecated: since 7.55.0. Use
	CURLINFO_CONTENT_LENGTH_DOWNLOAD_T [-Werror=deprecated-declarations]
	352 |		      throw_if_curl_error(curl_easy_getinfo(m_curl.get(),
	CURLINFO_CONTENT_LENGTH_DOWNLOAD, &content_length));
	--
	build/release/libs/freelan/src/curl.cpp: In member function ‘ptrdiff_t
	freelan::curl::get_content_length_upload()’:
	build/release/libs/freelan/src/curl.cpp:361:69: error: ‘CURLINFO_CONTENT_LENGTH_UPLOAD’
	is deprecated: since 7.55.0. Use CURLINFO_CONTENT_LENGTH_UPLOAD_T
	[-Werror=deprecated-declarations]
	361 |		      throw_if_curl_error(curl_easy_getinfo(m_curl.get(),
	CURLINFO_CONTENT_LENGTH_UPLOAD, &content_length));
	--
	g++ -o build/release/libs/asiotap/src/complex_filter.o -c -pipe -frecord-gcc-switches
	-Wall -g -O2 -flto=auto -Wno-missing-field-initializers --std=c++11 -Wall
	-Wextra -Werror -pedantic -O3 -DUSE_UPNP -DFREELAN_INSTALL_PREFIX="\"/\""
	-Ibuild/release/libs/asiotap/include/asiotap -Ibuild/release/include
	build/release/libs/asiotap/src/complex_filter.cpp
	cc1plus: all warnings being treated as errors
	scons: *** [build/release/libs/freelan/src/curl.o] Error 1

freeswitch-1:1.10.7-alt1.3
	src/switch_curl.c: In function 'switch_curl_process_form_post_params':
	src/switch_curl.c:90:41: error: 'curl_formadd' is deprecated: since 7.56.0. Use
	curl_mime_init() [-Werror=deprecated-declarations]
	90 |					     curl_formadd(&formpost,
	--
	2570 | curl_formadd(struct curl_httppost **httppost,
	src/switch_curl.c:92:66: error: 'CURLFORM_COPYNAME' is deprecated: since 7.56.0. Use
	curl_mime_name() [-Werror=deprecated-declarations]
	92 |								      CURLFORM_COPYNAME,
	pname,
	--
	2495 |	 CURLFORM_COPYNAME	  CURL_DEPRECATED(7.56.0, "Use curl_mime_name()"),
	src/switch_curl.c:93:66: error: 'CURLFORM_FILENAME' is deprecated: since 7.56.0. Use
	curl_mime_filename() [-Werror=deprecated-declarations]
	93 |								      CURLFORM_FILENAME,
	fname,
	--
	2512 |	 CURLFORM_FILENAME	  CURL_DEPRECATED(7.56.0, "Use curl_mime_filename()"),
	src/switch_curl.c:94:66: error: 'CURLFORM_FILE' is deprecated: since 7.56.0. Use
	curl_mime_filedata() [-Werror=deprecated-declarations]
	94 |								      CURLFORM_FILE,
	hp->value,
	--
	2504 |	 CURLFORM_FILE		  CURL_DEPRECATED(7.56.0, "Use curl_mime_filedata()"),
	src/switch_curl.c:100:25: error: 'curl_formadd' is deprecated: since 7.56.0. Use
	curl_mime_init() [-Werror=deprecated-declarations]
	100 |			      curl_formadd(&formpost,
	--
	2570 | curl_formadd(struct curl_httppost **httppost,
	src/switch_curl.c:102:50: error: 'CURLFORM_COPYNAME' is deprecated: since 7.56.0. Use
	curl_mime_name() [-Werror=deprecated-declarations]
	102 |						       CURLFORM_COPYNAME, hp->name,
	--
	2495 |	 CURLFORM_COPYNAME	  CURL_DEPRECATED(7.56.0, "Use curl_mime_name()"),
	src/switch_curl.c:103:50: error: 'CURLFORM_COPYCONTENTS' is deprecated: since 7.56.0. Use
	curl_mime_data() [-Werror=deprecated-declarations]
	103 |						       CURLFORM_COPYCONTENTS, hp->value,
	--
	2498 |	 CURLFORM_COPYCONTENTS	  CURL_DEPRECATED(7.56.0, "Use curl_mime_data()"),
	cc1: all warnings being treated as errors
	make[1]: *** [Makefile:2814: src/libfreeswitch_la-switch_curl.lo] Error 1

gcr-3.41.1-alt2
	+ xvfb-run /usr/bin/meson test --no-rebuild --print-errorlogs -C x86_64-alt-linux -t 2
	_XSERVTransmkdir: ERROR: euid != 0,directory /tmp/.X11-unix will not be created.
	<12>Dec 22 03:00:59 egg-hkdf: Libgcrypt warning: missing initialization - please fix
	the application
	--
	<12>Dec 22 03:00:59 test-gnupg-collection: Libgcrypt warning: missing initialization -
	please fix the application
	<28>Dec 22 03:00:59 dbus-daemon[2246736]: Failed to start message bus: Failed to bind
	socket "/run/dbus/users/dbus-nYI97GZSUp": No such file or directory
	1/43 gcr:egg / asn1		       OK	       0.11s

gcr4-4.0.0-alt1
	+ xvfb-run /usr/bin/meson test --no-rebuild --print-errorlogs -C x86_64-alt-linux -t 3
	_XSERVTransmkdir: ERROR: euid != 0,directory /tmp/.X11-unix will not be created.
	<12>Dec 22 02:52:12 egg-hkdf: Libgcrypt warning: missing initialization - please fix
	the application
	--
	40/44 gcr:gcr / ssh-askpass	   OK		   0.06s
	<28>Dec 22 02:52:13 dbus-daemon[3407375]: Failed to start message bus: Failed to bind
	socket "/run/dbus/users/dbus-GUajmyGdSr": No such file or directory
	41/44 gcr:gcr / system-prompt	   FAIL		   0.09s   killed by signal 5 SIGTRAP

gdm-43.0-alt2
	+ dbus-run-session /usr/bin/meson test --no-rebuild --print-errorlogs -C x86_64-alt-linux
	dbus-daemon[3378854]: Failed to start message bus: Failed to bind socket
	"/run/dbus/users/dbus-hHfhmn3WvK": No such file or directory
	dbus-run-session: EOF reading address from bus daemon

glade-3.40.0-alt2
	+ dbus-run-session xvfb-run /usr/bin/meson test --no-rebuild --print-errorlogs -C
	x86_64-alt-linux
	dbus-daemon[379073]: Failed to start message bus: Failed to bind socket
	"/run/dbus/users/dbus-PV7XzBDdsN": No such file or directory
	dbus-run-session: EOF reading address from bus daemon

gnome-bluetooth-3.34.5-alt3
	+ dbus-run-session ninja-build -C x86_64-alt-linux test
	dbus-daemon[1489220]: Failed to start message bus: Failed to bind socket
	"/run/dbus/users/dbus-jRSJnFDPHS": No such file or directory
	dbus-run-session: EOF reading address from bus daemon

grilo-plugins-0.3.15-alt2.1
	+ xvfb-run /usr/bin/meson test --no-rebuild --print-errorlogs -C x86_64-alt-linux
	_XSERVTransmkdir: ERROR: euid != 0,directory /tmp/.X11-unix will not be created.
	1/18 test_lua_factory_grl_media      OK		     0.08s
	--
	stderr:
	ERROR: Failed to start D-Bus daemon.
	dbus-daemon[200678]: Failed to start message bus: Failed to bind socket
	"/run/dbus/users/dbus-7sAsVPG7HS": No such file or directory
	16/18 test_chromaprint_resolve	      OK	      0.36s

janus-1.1.0-alt1
	turnrest.c: In function 'janus_turnrest_request':
	turnrest.c:164:9: error: void value not ignored as it ought to be
	164 |	      curl_easy_setopt(curl, api_http_get ? CURLOPT_HTTPGET : CURLOPT_POST, 1);

libdeltacloud-0.9-alt2_17
	curl_action.c: In function 'do_multipart_post_url':
	curl_action.c:321:3: error: 'CURLOPT_HTTPPOST' is deprecated: since 7.56.0. Use
	CURLOPT_MIMEPOST [-Werror=deprecated-declarations]
	321 |	res = curl_easy_setopt(curl, CURLOPT_HTTPPOST, httppost);
	--
	1195 |	 CURLOPTDEPRECATED(CURLOPT_HTTPPOST, CURLOPTTYPE_OBJECTPOINT, 24,
	cc1: all warnings being treated as errors
	make[2]: *** [Makefile:495: curl_action.lo] Error 1

libisds-0.11.2-alt1_2
	soap.c: In function 'http':
	soap.c:798:13: error: 'CURLOPT_PROGRESSFUNCTION' is deprecated: since 7.32.0. Use
	CURLOPT_XFERINFOFUNCTION [-Werror=deprecated-declarations]
	798 |		  curl_err = curl_easy_setopt(context->curl,
	--
	1295 |	 CURLOPTDEPRECATED(CURLOPT_PROGRESSFUNCTION, CURLOPTTYPE_FUNCTIONPOINT, 56,
	cc1: all warnings being treated as errors
	make[2]: *** [Makefile:603: libisds_la-soap.lo] Error 1

libxfconf-4.18.0-alt1
	<28>Dec 22 02:55:39 dbus-daemon[4026074]: Failed to start message bus: Failed to bind
	socket "/run/dbus/users/dbus-cKpzCtrYHj": No such file or directory
	FAIL: t-reset-arrayv
	<28>Dec 22 02:55:39 dbus-daemon[4026247]: Failed to start message bus: Failed to bind
	socket "/run/dbus/users/dbus-a5ktZy7bqa": No such file or directory
	<28>Dec 22 02:55:39 dbus-daemon[4026604]: Failed to start message bus: Failed to bind
	socket "/run/dbus/users/dbus-vdJxmsiuoc": No such file or directory
	FAIL: t-reset-boolean
	<28>Dec 22 02:55:39 dbus-daemon[4026738]: Failed to start message bus: Failed to bind
	socket "/run/dbus/users/dbus-bCMcAffgWx": No such file or directory
	<28>Dec 22 02:55:39 dbus-daemon[4027058]: Failed to start message bus: Failed to bind
	socket "/run/dbus/users/dbus-7c3AFoRCs5": No such file or directory
	FAIL: t-reset-stringlist
	Testsuite summary for xfconf 4.18.0
	--
	# SKIP:  0
	# XFAIL: 0
	# FAIL:  7
	# XPASS: 0

lightdm-1.30.0-alt22
	FAIL: test-xremote-login-logout
	FAIL: test-xdmcp-client
	FAIL: test-xdmcp-client-xorg-1.16
	FAIL: test-xdmcp-server-autologin
	FAIL: test-xdmcp-server-login
	FAIL: test-xdmcp-server-login-logout
	FAIL: test-xdmcp-server-double-login
	FAIL: test-xdmcp-server-guest
	FAIL: test-xdmcp-server-keep-alive
	FAIL: test-xdmcp-server-hostname
	FAIL: test-xdmcp-server-xdm-authentication

litmus-0.14.0-alt2.git.9fbc73d
	checking for a BSD-compatible install... /bin/install -c
	./configure: line 2846: syntax error near unexpected token `0,'
	./configure: line 2846: `NE_REQUIRE_VERSIONS(0, 26 27 28 29 30 31 32)'

newsboat-2.29-alt1
	src/poddlthread.cpp: In member function 'void podboat::PodDlThread::run()':
	src/poddlthread.cpp:65:31: error: 'CURLOPT_PROGRESSFUNCTION' is deprecated: since
	7.32.0. Use CURLOPT_XFERINFOFUNCTION [-Werror=deprecated-declarations]
	65 |		     handle.ptr(), CURLOPT_PROGRESSFUNCTION, progress_callback);
	--
	1295 |	 CURLOPTDEPRECATED(CURLOPT_PROGRESSFUNCTION, CURLOPTTYPE_FUNCTIONPOINT, 56,
	cc1plus: all warnings being treated as errors
	make: *** [Makefile:175: src/poddlthread.o] Error 1

oddjob-0.34.7-alt1
	./test-oddjobd.sh
	dbus-daemon[3552154]: Failed to start message bus: Failed to bind socket
	"/run/dbus/users/dbus-w5EttXife9": No such file or directory
	<28>Dec 22 02:56:54 dbus-daemon[3552154]: Failed to start message bus: Failed to bind
	socket "/run/dbus/users/dbus-w5EttXife9": No such file or directory
	EOF in dbus-launch reading address from bus daemon

perl-Gnome2-GConf-1.047-alt1
	+ xvfb-run -a make test
	_XSERVTransmkdir: ERROR: euid != 0,directory /tmp/.X11-unix will not be created.
	make: Entering directory '/usr/src/RPM/BUILD/Gnome2-GConf-1.047'
	--
	PERL_DL_NONLAZY=1 "/usr/bin/perl" "-MExtUtils::Command::MM" "-MTest::Harness" "-e"
	"undef *Test::Harness::Switches; test_harness(0, 'blib/lib', 'blib/arch')" t/*.t
	<28>Dec 22 01:31:53 dbus-daemon[2108900]: Failed to start message bus: Failed to bind
	socket "/run/dbus/users/dbus-EGv8Er2efY": No such file or directory
	Client failed to connect to the D-BUS daemon:
	/bin/dbus-launch terminated abnormally with the following error: EOF in dbus-launch
	reading address from bus daemon
	at t/00.GConf.t line 31.
	--
	Result: FAIL
	Failed 1/1 test programs. 0/3 subtests failed.
	make: *** [Makefile:1053: test_dynamic] Error 255

perl-WWW-Curl-4.17-alt6
	2678 |		   if (strEQ(name, "ANYSAFE")) return CURLAUTH_ANYSAFE;
	curlopt-constants.c:2771:58: error: 'CURLOPTDEPRECATED' undeclared (first use in this
	function); did you mean 'CURLOPT_PRIVATE'?
	2771 |		   if (strEQ(name, "CURLOPTDEPRECATED")) return CURLOPTDEPRECATED;
	--
	In file included from /usr/include/curl/curl.h:3195:
	Curl.xs:692:25: error: void value not ignored as it ought to be
	692 |			      curl_easy_setopt(clone->curl, 10000 + i, clone->strings[i]);

php8.1-8.1.13-alt1
	Time taken	: 1118 seconds
	EXPECTED FAILED TEST SUMMARY
	Test open_basedir configuration [tests/security/open_basedir_linkinfo.phpt]  XFAIL
	REASON: BUG: open_basedir cannot delete symlink to prohibited file. See also
	--
	updateTimestamp never called when session data is empty [ext/session/tests/bug71162.phpt]
	XFAIL REASON: Current session module is designed to write empty session always. In
	addition, current session module only supports SessionHandlerInterface only from PHP 7.0.
	FAILED TEST SUMMARY
	proc_open [ext/standard/tests/general_functions/proc_open02.phpt]

python-module-dbus-1.2.18-alt2
	make[3]: Entering directory '/usr/src/RPM/BUILD/dbus-python-1.2.18/dbus-gmain'
	FAIL: tests/test-30574
	Testsuite summary for dbus-python 1.2.18
	--
	# SKIP:  0
	# XFAIL: 0
	# FAIL:  1
	# XPASS: 0
	# ERROR: 0
	See dbus-gmain/test-suite.log

python3-module-dbus-next-0.2.3-alt1
	+ /bin/dbus-run-session -- /usr/bin/python3 -m pytest test
	dbus-daemon[370359]: Failed to start message bus: Failed to bind socket
	"/run/dbus/users/dbus-rw1D0hnAxO": No such file or directory
	dbus-run-session: EOF reading address from bus daemon

python3-module-easyprocess-1.1-alt1
	tests/test_fast/test_proc.py::test_start3 PASSED			 [ 21%]
	tests/test_fast/test_proc.py::test_alive FAILED				 [ 23%]
	tests/test_fast/test_proc.py::test_std PASSED				 [ 26%]
	--
	=========================== short test summary info ============================
	FAILED tests/test_fast/test_proc.py::test_alive - assert False
	=================== 1 failed, 37 passed in 78.47s (0:01:18) ====================

python3-module-pytz-deprecation-shim-0.1.0.post0-alt1
	=========================== short test summary info ============================
	FAILED tests/test_shims.py::test_normalize_pytz_zone - assert datetime.dateti...
	================== 1 failed, 419 passed, 33 warnings in 2.74s ==================

vala-0.56.3-alt1
	# SKIP:  0
	# XFAIL: 0
	# FAIL:  24
	# XPASS: 0
	# ERROR: 0
	See tests/test-suite.log

wine-cpcsp_proxy-0.6.0-alt3
	make: Leaving directory '/usr/src/RPM/BUILD/wine-cpcsp_proxy-0.6.0/cpcsp_proxy'
	make: *** Waiting for unfinished jobs....
	make: Entering directory '/usr/src/RPM/BUILD/wine-cpcsp_proxy-0.6.0/cpcsp_proxy'
	winegcc  -c -o proxy.o proxy.c -g -O2 -fPIC -Wall -D__WINESRC__ -shared
	winegcc: Could not find g++
	make: *** [Makefile:10: proxy.o] Error 2
	make: Leaving directory '/usr/src/RPM/BUILD/wine-cpcsp_proxy-0.6.0/cpcsp_proxy'
	make: Entering directory '/usr/src/RPM/BUILD/wine-cpcsp_proxy-0.6.0/cpcsp_proxy'
	winegcc  -o cpcsp_proxy.dll -Wb,--fake-module -shared cpcsp_proxy.spec -mno-cygwin
	make: Leaving directory '/usr/src/RPM/BUILD/wine-cpcsp_proxy-0.6.0/cpcsp_proxy'

xdg-dbus-proxy-0.1.4-alt1
	stderr:
	dbus-daemon[4180584]: Failed to start message bus: Failed to bind socket
	"/run/dbus/users/dbus-DkOyMz7clK": No such file or directory
	Summary of Failures:

zabbix-1:6.0.12-alt1
	simple.c: In function 'check_https':
	simple.c:180:65: error: invalid use of void expression
	180 |	      if (CURLE_OK != (err = curl_easy_setopt(easyhandle, opt = CURLOPT_USERAGENT,
	"Zabbix " ZABBIX_VERSION)) ||
	simple.c:181:69: error: invalid use of void expression
	181 |		      CURLE_OK != (err = curl_easy_setopt(easyhandle, opt = CURLOPT_URL,
	https_host)) ||
	simple.c:182:69: error: invalid use of void expression
	182 |		      CURLE_OK != (err = curl_easy_setopt(easyhandle, opt = CURLOPT_PORT,
	(long)port)) ||
	simple.c:183:69: error: invalid use of void expression
	183 |		      CURLE_OK != (err = curl_easy_setopt(easyhandle, opt = CURLOPT_NOBODY,
	1L)) ||
	simple.c:184:69: error: invalid use of void expression
	184 |		      CURLE_OK != (err = curl_easy_setopt(easyhandle, opt =
	CURLOPT_SSL_VERIFYPEER, 0L)) ||
	simple.c:185:69: error: invalid use of void expression
	185 |		      CURLE_OK != (err = curl_easy_setopt(easyhandle, opt =
	CURLOPT_SSL_VERIFYHOST, 0L)) ||
	simple.c:186:69: error: invalid use of void expression
	186 |		      CURLE_OK != (err = curl_easy_setopt(easyhandle, opt =
	CURLOPT_TIMEOUT, (long)timeout)) ||
	simple.c:187:69: error: invalid use of void expression
	187 |		      CURLE_OK != (err = curl_easy_setopt(easyhandle, opt =
	ZBX_CURLOPT_ACCEPT_ENCODING, "")))
	simple.c:196:73: error: invalid use of void expression
	196 |		      if (CURLE_OK != (err = curl_easy_setopt(easyhandle, opt =
	CURLOPT_INTERFACE, CONFIG_SOURCE_IP)))

zabbix34-agent-3.4.15-alt2
	simple.c: In function 'check_https':
	simple.c:198:65: error: invalid use of void expression
	198 |	      if (CURLE_OK != (err = curl_easy_setopt(easyhandle, opt = CURLOPT_USERAGENT,
	"Zabbix " ZABBIX_VERSION)) ||
	simple.c:199:69: error: invalid use of void expression
	199 |		      CURLE_OK != (err = curl_easy_setopt(easyhandle, opt = CURLOPT_URL,
	https_host)) ||
	simple.c:200:69: error: invalid use of void expression
	200 |		      CURLE_OK != (err = curl_easy_setopt(easyhandle, opt = CURLOPT_PORT,
	(long)port)) ||
	simple.c:201:69: error: invalid use of void expression
	201 |		      CURLE_OK != (err = curl_easy_setopt(easyhandle, opt = CURLOPT_NOBODY,
	1L)) ||
	simple.c:202:69: error: invalid use of void expression
	202 |		      CURLE_OK != (err = curl_easy_setopt(easyhandle, opt =
	CURLOPT_SSL_VERIFYPEER, 0L)) ||
	simple.c:203:69: error: invalid use of void expression
	203 |		      CURLE_OK != (err = curl_easy_setopt(easyhandle, opt =
	CURLOPT_SSL_VERIFYHOST, 0L)) ||
	simple.c:204:69: error: invalid use of void expression
	204 |		      CURLE_OK != (err = curl_easy_setopt(easyhandle, opt =
	CURLOPT_TIMEOUT, (long)timeout)))
	simple.c:213:73: error: invalid use of void expression
	213 |		      if (CURLE_OK != (err = curl_easy_setopt(easyhandle, opt =
	CURLOPT_INTERFACE, CONFIG_SOURCE_IP)))

	3 error logs REMOVED from the list
altlinux-freedesktop-menu-0.68-alt1
automake_1.16-1.16.3-alt1
cilk-5.4.6-alt13

Total 101 error logs.


Sisyphus-cybertalk