[cyber] I: p9-20221218 x86_64 beehive_status: +8 -3 (265)

ALT beekeeper hiver на altlinux.org
Вс Дек 18 18:09:14 MSK 2022

	8 NEW error logs

	ar  rc	lib3d.a net_analyzer.o d3_xUtils.o d3_global.o d3_anageo.o d3_shade.o d3_lists.o
	d3_point.o d3_dither.o d3_zgraph.o d3_fonts.o d3_graph.o d3_draw.o d3_disp.o d3_move.o
	d3_zValue.o d3_setup.o d3_units.o d3_links.o d3_model.o d3_project.o d3_light.o
	d3_pannels.o d3_main.o bn_bignet.o bn_basics.o bn_art1.o bn_art2.o bn_artmap.o
	bn_TD_bignet.o bn_kohonen.o bn_assoz.o o_graph.o bn_JordElm.o ui_class.o bn_bighop.o
	ranlib	lib3d.a
	make[1]: Leaving directory '/usr/src/RPM/BUILD/SNNSv4.3/xgui/sources'
	make[1]: Entering directory '/usr/src/RPM/BUILD/SNNSv4.3/xgui/sources'
	x86_64-alt-linux-gcc  libxgui1.a libxgui2.a lib3d.a \
	-lXaw3d -lXmu -lXt -lXext -lSM -lICE  -lX11  \
	../../kernel/sources/libkernel.a ../../kernel/sources/libfunc.a -lm -lfl  -o xgui
	/usr/bin/ld.default: libxgui1.a(ui_controlP.o): in function `ui_rem_performPrunInit':
	/usr/src/RPM/BUILD/SNNSv4.3/xgui/sources/ui_controlP.c:1191: warning: the use of
	`tempnam' is dangerous, better use `mkstemp'
	make[1]: Leaving directory '/usr/src/RPM/BUILD/SNNSv4.3/xgui/sources'

	checking for upc... no
	configure: error: no Unified Parallel C compiler was found
	+ exit_status=77
	+ exit 77
	1 of 893 tests failed
	(58 tests were not run)

	Start 16: test_2dcircles_opt_geometric
	hasher-privd: parent: handle_io: idle time limit (3600 seconds) exceeded

	parser-smi.c:9963:29: warning: passing argument 1 of 'smiyyerror' discards 'const'
	qualifier from pointer target type [-Wdiscarded-qualifiers]
	yyerror (parserPtr, yymsgp);
	error.h:25:44: note: in definition of macro 'yyerror'
	#define yyerror(parserPtr, msg) smiyyerror(msg, parserPtr)
	In file included from parser-smi.y:40:
	smi-check.h:71:30: note: expected 'char *' but argument is of type 'const char *'
	extern void smiyyerror(char *msg, Parser *parserPtr);
	make[2]: Leaving directory '/usr/src/RPM/BUILD/libsmi-0.5.0/lib'
	make[1]: *** [Makefile:516: all-recursive] Error 1
	make: *** [Makefile:402: all] Error 2

	t/150_syn_inst.t ...... ok
	#   Failed test 'Make sure it died for a good excuse'
	#   at t/190_alarm.t line 54.
	t/190_alarm.t	    (Wstat: 256 Tests: 6 Failed: 1)
	Failed test:  6
	Non-zero exit status: 1
	Result: FAIL
	Failed 1/17 test programs. 1/66 subtests failed.
	make: *** [Makefile:784: test_dynamic] Error 255

	Extracting pycodestyle-2.5.0-py3.7.egg to
	error: [Errno 2] No such file or directory: 'build/bdist.linux-x86_64/egg/pycodestyle.pyc'
	ERROR: InvocationError for command
	/usr/src/RPM/BUILD/python-module-pycodestyle-2.5.0/.tox/py27/bin/python setup.py install
	(exited with code 1)
	Adding pycodestyle 2.5.0 to easy-install.pth file
	Finished processing dependencies for pycodestyle==2.5.0
	ERROR: invocation failed (exit code 1)
	Б°√ FAIL py27 in 2.967 seconds
	___________________________________ summary ____________________________________
	ERROR:	 py27: parallel child exit code 1
	py37: commands succeeded

	SyntaxError: Missing parentheses in call to 'print'. Did you mean print("*** created
	tst.dbf: ***"))?
	line=291 IGNORE (for REQ=slight and deep=8) module=sys
	python.req: ERROR:
	invalid syntax (line 163)
	Traceback (most recent call last):
	print "*** created tst.dbf: ***")
	SyntaxError: invalid syntax
	find-requires: ERROR: /usr/lib/rpm/python.req failed
	error: /bin/sh failed
	error: Failed to find Requires
	RPM build errors:

	make: Leaving directory '/usr/src/RPM/BUILD/quilt-0.66-alt1'
	make: Entering directory '/usr/src/RPM/BUILD/quilt-0.66-alt1'
	66 commands (66 passed, 0 failed)
	make: Leaving directory '/usr/src/RPM/BUILD/quilt-0.66-alt1'
	make: Entering directory '/usr/src/RPM/BUILD/quilt-0.66-alt1'
	57 commands (57 passed, 0 failed)
	make: Leaving directory '/usr/src/RPM/BUILD/quilt-0.66-alt1'
	make: Target 'check' not remade because of errors.

	3 error logs REMOVED from the list

Total 265 error logs.

Подробная информация о списке рассылки Sisyphus-cybertalk