[cyber] I: Sisyphus-20221211 i586 beehive_status: +13 -16 (88)

ALT beekeeper hiver altlinux.org
11 03:28:18 MSK 2022


	13 NEW error logs

altlinux-freedesktop-menu-0.68-alt1
	+ j=altlinux-webdevelopment.directory
	+ grep altlinux-webdevelopment.directory ignore.list
	+ grep 'Name\[ru\]=' desktop-directories/altlinux-webdevelopment.directory
	+ for i in desktop-directories/*.directory
	++ basename desktop-directories/altlinux-xfce.directory
	+ j=altlinux-xfce.directory
	+ grep altlinux-xfce.directory ignore.list
	+ rm ignore.list
	+ '[' 0 -gt 0 ']'
	+ exit 1

curl-7.86.0-alt1
	TESTDONE: 1285 tests out of 1286 reported OK: 99%
	TESTFAIL: These test cases failed: 587
	make[1]: *** [Makefile:821: full-test] Error 1

gamescope-3.11.26-alt1
	Looking for a fallback subproject for the dependency wlroots
	meson.build:50:0: ERROR: Subproject exists but has no meson.build file
	A full log can be found at
	/usr/src/RPM/BUILD/gamescope-3.11.26/i586-alt-linux/meson-logs/meson-log.txt

gawk-5.1.0.0.213.d04f-alt1
	make[3]: Entering directory '/usr/src/RPM/BUILD/gawk-5.1.0.0.213.d04f-alt1/test'
	1 TESTS FAILED
	make[3]: *** [Makefile:5248: pass-fail] Error 1

liboqs-0.7.2-alt1
	[gw0] [ 81%] PASSED tests/test_mem.py::test_mem_kem[ntrulpr761]
	tests/test_mem.py::test_mem_kem[ntrulpr857]
	[gw0] [ 81%] PASSED tests/test_mem.py::test_mem_kem[ntrulpr857]
	tests/test_mem.py::test_mem_kem[ntrulpr1277]
	[gw4] [ 81%] PASSED tests/test_kat.py::test_sig[SPHINCS+-Haraka-192s-simple]
	tests/test_kat.py::test_sig[SPHINCS+-Haraka-256f-robust]
	[gw0] [ 81%] PASSED tests/test_mem.py::test_mem_kem[ntrulpr1277]
	tests/test_mem.py::test_mem_kem[sntrup653]
	[gw0] [ 81%] PASSED tests/test_mem.py::test_mem_kem[sntrup653]
	tests/test_mem.py::test_mem_kem[sntrup761] ninja: build stopped: interrupted by user.

meschach-1.2-alt1.b.3
	ranlib meschach.a
	ranlib: meschach.a: error reading zfunc.o: file truncated
	make: *** [makefile:94: zpart1] Error 1
	make: Leaving directory '/usr/src/RPM/BUILD/meschach-1.2'
	make: *** Waiting for unfinished jobs....
	make: Entering directory '/usr/src/RPM/BUILD/meschach-1.2'
	gcc -c -g -O2 -pipe -Wall -fPIC -DPIC -DHAVE_CONFIG_H zschur.c
	zschur.c:40:13: warning: 'rcsid' defined but not used [-Wunused-variable]
	40 | static char rcsid[] = "$Id: zschur.c,v 1.4 1995/04/07 16:28:58 des Exp $";
	make: Leaving directory '/usr/src/RPM/BUILD/meschach-1.2'

perl-Server-Starter-0.35-alt1.1
	received TERM, sending TERM to all workers:2173636
	hasher-privd: parent: handle_io: idle time limit (3600 seconds) exceeded

python3-module-cloudpickle-2.0.0-alt2
	>	    return Pickler.dump(self, obj)
	E	    TypeError: cannot pickle 'classmethod_descriptor' object
	cloudpickle/cloudpickle_fast.py:602: TypeError
	--
	>	    return Pickler.dump(self, obj)
	E	    TypeError: cannot pickle 'classmethod_descriptor' object
	cloudpickle/cloudpickle_fast.py:602: TypeError
	--
	=========================== short test summary info ============================
	FAILED tests/cloudpickle_test.py::CloudPickleTest::test_builtin_classmethod
	FAILED tests/cloudpickle_test.py::Protocol2CloudPickleTest::test_builtin_classmethod
	====== 2 failed, 237 passed, 8 skipped, 3 deselected, 4 warnings in 8.84s ======

python3-module-easyprocess-1.1-alt1
	tests/test_fast/test_proc.py::test_start3 PASSED			 [ 21%]
	tests/test_fast/test_proc.py::test_alive FAILED				 [ 23%]
	tests/test_fast/test_proc.py::test_std PASSED				 [ 26%]
	--
	tests/test_fast/test_proc.py::test_wrap PASSED				 [ 31%]
	tests/test_fast/test_proc.py::test_with FAILED				 [ 34%]
	tests/test_fast/test_proc.py::test_parse PASSED				 [ 36%]
	--
	=========================== short test summary info ============================
	FAILED tests/test_fast/test_proc.py::test_alive - assert False
	FAILED tests/test_fast/test_proc.py::test_with - assert False
	=================== 2 failed, 36 passed in 78.91s (0:01:18) ====================

python3-module-pywlroots-0.15.24-alt1
	wlroots/_ffi.c:18587:59: error: ‘struct wlr_xdg_positioner’ has no member named
	‘anchor_rect’
	18587 |			   sizeof(((struct wlr_xdg_positioner *)0)->anchor_rect),
	wlroots/_ffi.c:18589:15: error: ‘struct wlr_xdg_positioner’ has no member named
	‘anchor’
	18589 |   { "anchor", offsetof(struct wlr_xdg_positioner, anchor),
	wlroots/_ffi.c:18590:54: error: ‘struct wlr_xdg_positioner’ has no member named
	‘anchor’
	18590 |		      sizeof(((struct wlr_xdg_positioner *)0)->anchor),
	wlroots/_ffi.c:18592:16: error: ‘struct wlr_xdg_positioner’ has no member named
	‘gravity’
	18592 |   { "gravity", offsetof(struct wlr_xdg_positioner, gravity),
	wlroots/_ffi.c:18593:55: error: ‘struct wlr_xdg_positioner’ has no member named
	‘gravity’
	18593 |		       sizeof(((struct wlr_xdg_positioner *)0)->gravity),
	wlroots/_ffi.c:18595:30: error: ‘struct wlr_xdg_positioner’ has no member named
	‘constraint_adjustment’
	18595 |   { "constraint_adjustment", offsetof(struct wlr_xdg_positioner,
	constraint_adjustment),
	wlroots/_ffi.c:18596:69: error: ‘struct wlr_xdg_positioner’ has no member named
	‘constraint_adjustment’
	18596 |				     sizeof(((struct wlr_xdg_positioner
	*)0)->constraint_adjustment),
	wlroots/_ffi.c:18598:13: error: ‘struct wlr_xdg_positioner’ has no member named
	‘size’
	18598 |   { "size", offsetof(struct wlr_xdg_positioner, size),
	wlroots/_ffi.c:18599:52: error: ‘struct wlr_xdg_positioner’ has no member named
	‘size’
	18599 |		    sizeof(((struct wlr_xdg_positioner *)0)->size),
	wlroots/_ffi.c:18601:15: error: ‘struct wlr_xdg_positioner’ has no member named
	‘offset’
	18601 |   { "offset", offsetof(struct wlr_xdg_positioner, offset),

python3-module-zmq-24.0.1-alt1.1
	zmq/backend/cython/socket.pyx:787: in zmq.backend.cython.socket.Socket.send
	E   zmq.error.ZMQError: Socket operation on non-socket
	zmq/backend/cython/socket.pyx:138: ZMQError
	--
	zmq/backend/cython/socket.pyx:787: in zmq.backend.cython.socket.Socket.send
	E   zmq.error.ZMQError: Socket operation on non-socket
	zmq/backend/cython/socket.pyx:138: ZMQError
	--
	zmq/backend/cython/socket.pyx:787: in zmq.backend.cython.socket.Socket.send
	E   zmq.error.ZMQError: Socket operation on non-socket
	zmq/backend/cython/socket.pyx:138: ZMQError
	--
	zmq/backend/cython/socket.pyx:787: in zmq.backend.cython.socket.Socket.send
	E   zmq.error.ZMQError: Socket operation on non-socket
	zmq/backend/cython/socket.pyx:138: ZMQError
	--
	=========================== short test summary info ============================
	FAILED tests/test_log.py::TestPubLog::test_blank_root_topic - TimeoutError: T...
	FAILED tests/test_log.py::TestPubLog::test_custom_debug_formatter - zmq.error...
	FAILED tests/test_log.py::TestPubLog::test_custom_global_formatter - zmq.erro...
	FAILED tests/test_log.py::TestPubLog::test_init_iface - zmq.error.ZMQError: S...
	FAILED tests/test_log.py::TestPubLog::test_init_socket - zmq.error.ZMQError: ...
	FAILED tests/test_log.py::TestPubLog::test_root_topic - zmq.error.ZMQError: S...
	FAILED tests/test_log.py::TestPubLog::test_set_info_formatter_via_property - ...

qtile-0.22.1-alt1
	from build/temp.linux-i686-cpython-310/libqtile.backend.wayland._libinput.c:649:
	/usr/include/wlr/xwayland/xwayland.h:15:10: fatal error: xcb/xcb_icccm.h: No such file
	or directory
	15 | #include <xcb/xcb_icccm.h>
	compilation terminated.
	error: command '/usr/bin/i586-alt-linux-gcc' failed with exit code 1

quilt-0.67-alt1
	make: Leaving directory '/usr/src/RPM/BUILD/quilt-0.67-alt1'
	make: Entering directory '/usr/src/RPM/BUILD/quilt-0.67-alt1'
	[three.test]
	54 commands (54 passed, 0 failed)
	make: Leaving directory '/usr/src/RPM/BUILD/quilt-0.67-alt1'
	make: Entering directory '/usr/src/RPM/BUILD/quilt-0.67-alt1'
	[two.test]
	57 commands (57 passed, 0 failed)
	make: Leaving directory '/usr/src/RPM/BUILD/quilt-0.67-alt1'
	make: Target 'check' not remade because of errors.

	16 error logs REMOVED from the list
automake_1.11-1.11.6-alt9
automake_1.16-1.16.3-alt1
bind-9.16.35-alt1
cadaver-0.23.3-alt6.git.4cbea82
fprintd-1.94.2-alt1
innernet-1.5.1-alt1
kodi-19.4-alt2
libpsl-0.21.1-alt2
libvamp-2.10.0-alt1
maven-compiler-plugin-3.8.1-alt1_10jpp11
nautilus-dropbox-2020.03.04-alt1
pngcrush-1.8.13-alt1
putty-0.76-alt1
python3-module-pytz-deprecation-shim-0.1.0.post0-alt1
scalacheck-1.15.4-alt1_2jpp11
t1lib-5.1.2-alt6

Total 88 error logs.


Sisyphus-cybertalk