[cyber] I: Sisyphus-20221204 x86_64 beehive_status: +10 -8 (83)

ALT beekeeper hiver altlinux.org
4 15:04:03 MSK 2022


	10 NEW error logs

automake_1.11-1.11.6-alt9
	checking for upc... no
	configure: error: no Unified Parallel C compiler was found
	+ exit_status=77
	--
	+ exit 77
	1 of 878 tests failed
	(73 tests were not run)

clickhouse-22.8.9.24-alt1
	[  PASSED  ] 10332 tests.
	[  FAILED  ] 1 test, listed below:
	[  FAILED  ] CoordinationTestSuite/CoordinationTest.TestRotateIntervalChanges/0, where
	GetParam() = 32-byte object <01-9C 50-05 00-00 00-00 2E-7A 73-74 64-00 00-00 FE-6B
	2A-0F 00-00 00-00 80-ED 50-97 18-7F 00-05>
	1 FAILED TEST

cppcheck-2.9.0-alt1
	cd /usr/src/RPM/BUILD/cppcheck-2.9.0/x86_64-alt-linux/lib && /usr/bin/c++
	-DFILESDIR=\"/usr/share/Cppcheck\" -DHAVE_RULES -DTIXML_USE_STL
	-I/usr/src/RPM/BUILD/cppcheck-2.9.0/x86_64-alt-linux/lib
	-I/usr/src/RPM/BUILD/cppcheck-2.9.0/lib -isystem
	/usr/src/RPM/BUILD/cppcheck-2.9.0/externals -isystem
	/usr/src/RPM/BUILD/cppcheck-2.9.0/externals/tinyxml2 -isystem
	/usr/src/RPM/BUILD/cppcheck-2.9.0/externals/picojson -isystem
	/usr/src/RPM/BUILD/cppcheck-2.9.0/externals/simplecpp -isystem /usr/include/pcre -pipe
	-frecord-gcc-switches -Wall -g -O2 -flto=auto -O2 -DNDEBUG -O2 -pedantic -Wall -Wextra
	-Wcast-qual -Wfloat-equal -Wmissing-declarations -Wmissing-format-attribute -Wno-long-long
	-Wpacked -Wredundant-decls -Wundef -Wno-missing-field-initializers -Wno-missing-braces
	-Wno-sign-compare -Wno-multichar -pipe -Woverloaded-virtual -Wno-maybe-uninitialized
	-Wsuggest-attribute=noreturn -Wno-shadow -std=gnu++11 -Winvalid-pch -include
	/usr/src/RPM/BUILD/cppcheck-2.9.0/x86_64-alt-linux/lib/CMakeFiles/lib_objs.dir/cmake_pch.hxx
	-MD -MT lib/CMakeFiles/lib_objs.dir/build/mc_tokenize.cpp.o
	-MF CMakeFiles/lib_objs.dir/build/mc_tokenize.cpp.o.d
	-o CMakeFiles/lib_objs.dir/build/mc_tokenize.cpp.o -c
	/usr/src/RPM/BUILD/cppcheck-2.9.0/x86_64-alt-linux/lib/build/mc_tokenize.cpp
	gmake[2]: Leaving directory '/usr/src/RPM/BUILD/cppcheck-2.9.0/x86_64-alt-linux'
	gmake[2]: Entering directory '/usr/src/RPM/BUILD/cppcheck-2.9.0/x86_64-alt-linux'
	[ 48%] Building CXX object lib/CMakeFiles/lib_objs.dir/build/mc_valueflow.cpp.o
	cd /usr/src/RPM/BUILD/cppcheck-2.9.0/x86_64-alt-linux/lib && /usr/bin/c++
	-DFILESDIR=\"/usr/share/Cppcheck\" -DHAVE_RULES -DTIXML_USE_STL
	-I/usr/src/RPM/BUILD/cppcheck-2.9.0/x86_64-alt-linux/lib
	-I/usr/src/RPM/BUILD/cppcheck-2.9.0/lib -isystem
	/usr/src/RPM/BUILD/cppcheck-2.9.0/externals -isystem
	/usr/src/RPM/BUILD/cppcheck-2.9.0/externals/tinyxml2 -isystem
	/usr/src/RPM/BUILD/cppcheck-2.9.0/externals/picojson -isystem
	/usr/src/RPM/BUILD/cppcheck-2.9.0/externals/simplecpp -isystem /usr/include/pcre -pipe
	-frecord-gcc-switches -Wall -g -O2 -flto=auto -O2 -DNDEBUG -O2 -pedantic -Wall -Wextra
	-Wcast-qual -Wfloat-equal -Wmissing-declarations -Wmissing-format-attribute -Wno-long-long
	-Wpacked -Wredundant-decls -Wundef -Wno-missing-field-initializers -Wno-missing-braces
	-Wno-sign-compare -Wno-multichar -pipe -Woverloaded-virtual -Wno-maybe-uninitialized
	-Wsuggest-attribute=noreturn -Wno-shadow -std=gnu++11 -Winvalid-pch -include
	/usr/src/RPM/BUILD/cppcheck-2.9.0/x86_64-alt-linux/lib/CMakeFiles/lib_objs.dir/cmake_pch.hxx
	-MD -MT lib/CMakeFiles/lib_objs.dir/build/mc_valueflow.cpp.o
	-MF CMakeFiles/lib_objs.dir/build/mc_valueflow.cpp.o.d
	-o CMakeFiles/lib_objs.dir/build/mc_valueflow.cpp.o -c
	/usr/src/RPM/BUILD/cppcheck-2.9.0/x86_64-alt-linux/lib/build/mc_valueflow.cpp
	gmake[2]: Leaving directory '/usr/src/RPM/BUILD/cppcheck-2.9.0/x86_64-alt-linux'
	gmake[1]: Entering directory '/usr/src/RPM/BUILD/cppcheck-2.9.0/x86_64-alt-linux'
	[ 48%] Built target lib_objs
	gmake[1]: Leaving directory '/usr/src/RPM/BUILD/cppcheck-2.9.0/x86_64-alt-linux'
	gmake: *** [Makefile:146: all] Error 2

dopewars-1.5.12-alt2_20.1033svn
	ranlib: .libs/libsound_sdl.a(sound_sdl.o): plugin needed to handle lto object
	ranlib: unable to copy file '.libs/libsound_sdl.a'; reason: No such file or directory
	make[3]: *** [Makefile:428: libsound_sdl.la] Error 1

gamescope-3.11.26-alt1
	Looking for a fallback subproject for the dependency wlroots
	meson.build:50:0: ERROR: Subproject exists but has no meson.build file
	A full log can be found at
	/usr/src/RPM/BUILD/gamescope-3.11.26/x86_64-alt-linux/meson-logs/meson-log.txt

libsmi-0.5.0-alt2
	1896 |	       |	       Unsigned64Keyword optsep_numberSpec_01
	parser-sming.y:1896: error: "tribute_refinedBaseType" is not a valid filename
	1896 |	       |	       Unsigned64Keyword optsep_numberSpec_01
	--
	parser-yang.c:4913:7: note: in expansion of macro 'yyerror'
	4913 |	     yyerror (parserPtr, YY_("syntax error"));
	parser-yang.y: At top level:

perl-Test-LectroTest-0.5001-alt3
	t/docs-eg.t ............... ok
	#   Failed test 'Elements(a b c d e f g h i j) is complete and uniformly distributed'
	#   at /usr/share/perl5/Test/More.pm line 323.
	--
	t/gens.t		(Wstat: 256 Tests: 248 Failed: 1)
	Failed test:  53
	Non-zero exit status: 1
	--
	Result: FAIL
	Failed 1/12 test programs. 1/343 subtests failed.
	make: *** [Makefile:783: test_dynamic] Error 255

python3-module-pikepdf-6.2.1-alt2
	), "pikepdf did not close a stream it opened"
	E	AssertionError: pikepdf did not close a stream it opened
	E	assert not True
	--
	XFAIL tests/test_outlines.py::test_new_item - reason: Needs a qpdf fix
	FAILED tests/test_io.py::test_open_named_file_closed - AssertionError: pikepd...
	======= 1 failed, 536 passed, 10 skipped, 2 xfailed, 1 warning in 16.81s =======
	--
	errors that qpdf cannot detect
	ERROR: InvocationError for command /usr/src/RPM/BUILD/pikepdf-6.2.1/.tox/py3/bin/pytest
	-vra (exited with code 1)
	py3 finish: run-test  after 17.31 seconds
	--
	___________________________________ summary ____________________________________
	ERROR:	 py3: commands failed
	cleanup
	/usr/src/RPM/BUILD/pikepdf-6.2.1/.tox/.tmp/package/1/pikepdf-6.2.1-cp310-cp310-linux_x86_64.whl

python3-module-pywlroots-0.15.24-alt1
	wlroots/_ffi.c:18587:59: error: ‘struct wlr_xdg_positioner’ has no member named
	‘anchor_rect’
	18587 |			   sizeof(((struct wlr_xdg_positioner *)0)->anchor_rect),
	wlroots/_ffi.c:18589:15: error: ‘struct wlr_xdg_positioner’ has no member named
	‘anchor’
	18589 |   { "anchor", offsetof(struct wlr_xdg_positioner, anchor),
	wlroots/_ffi.c:18590:54: error: ‘struct wlr_xdg_positioner’ has no member named
	‘anchor’
	18590 |		      sizeof(((struct wlr_xdg_positioner *)0)->anchor),
	wlroots/_ffi.c:18592:16: error: ‘struct wlr_xdg_positioner’ has no member named
	‘gravity’
	18592 |   { "gravity", offsetof(struct wlr_xdg_positioner, gravity),
	wlroots/_ffi.c:18593:55: error: ‘struct wlr_xdg_positioner’ has no member named
	‘gravity’
	18593 |		       sizeof(((struct wlr_xdg_positioner *)0)->gravity),
	wlroots/_ffi.c:18595:30: error: ‘struct wlr_xdg_positioner’ has no member named
	‘constraint_adjustment’
	18595 |   { "constraint_adjustment", offsetof(struct wlr_xdg_positioner,
	constraint_adjustment),
	wlroots/_ffi.c:18596:69: error: ‘struct wlr_xdg_positioner’ has no member named
	‘constraint_adjustment’
	18596 |				     sizeof(((struct wlr_xdg_positioner
	*)0)->constraint_adjustment),
	wlroots/_ffi.c:18598:13: error: ‘struct wlr_xdg_positioner’ has no member named
	‘size’
	18598 |   { "size", offsetof(struct wlr_xdg_positioner, size),
	wlroots/_ffi.c:18599:52: error: ‘struct wlr_xdg_positioner’ has no member named
	‘size’
	18599 |		    sizeof(((struct wlr_xdg_positioner *)0)->size),
	wlroots/_ffi.c:18601:15: error: ‘struct wlr_xdg_positioner’ has no member named
	‘offset’
	18601 |   { "offset", offsetof(struct wlr_xdg_positioner, offset),

qtile-0.22.1-alt1
	from build/temp.linux-x86_64-cpython-310/libqtile.backend.wayland._libinput.c:649:
	/usr/include/wlr/xwayland/xwayland.h:15:10: fatal error: xcb/xcb_icccm.h: No such file
	or directory
	15 | #include <xcb/xcb_icccm.h>
	compilation terminated.
	error: command '/usr/bin/x86_64-alt-linux-gcc' failed with exit code 1

	8 error logs REMOVED from the list
gawk-5.1.0.0.213.d04f-alt1
innernet-1.5.1-alt1
jicofo-1.1-alt0.4
ldns-1.8.1-alt1
meschach-1.2-alt1.b.3
node-uglify-js-3.17.0-alt1
python3-module-easyprocess-1.1-alt1
yate-6.1.0-alt2

Total 83 error logs.


Sisyphus-cybertalk