[cyber] I: Sisyphus-20220820 i586 beehive_status: +17 -13 (109)

ALT beekeeper hiver altlinux.org
20 10:16:58 MSK 2022


	17 NEW error logs

alterator-datetime-4.7.1-alt1
	/usr/share/alterator/build/install-help
	find: '/usr/share/alterator/l10n': No such file or directory
	make[1]: Leaving directory '/usr/src/RPM/BUILD/alterator-datetime-4.7.1'

altlinux-freedesktop-menu-0.68-alt1
	+ j=altlinux-webdevelopment.directory
	+ grep altlinux-webdevelopment.directory ignore.list
	+ grep 'Name\[ru\]=' desktop-directories/altlinux-webdevelopment.directory
	+ for i in desktop-directories/*.directory
	++ basename desktop-directories/altlinux-xfce.directory
	+ j=altlinux-xfce.directory
	+ grep altlinux-xfce.directory ignore.list
	+ rm ignore.list
	+ '[' 0 -gt 0 ']'
	+ exit 1

borg-1.2.1-alt1
	+ cp -a src/borg/testsuite/attic.tar.gz
	/usr/src/RPM/BUILD/borg-1.2.1/build/lib.linux-i686-3.10/borg/testsuite/
	cp: cannot create regular file
	'/usr/src/RPM/BUILD/borg-1.2.1/build/lib.linux-i686-3.10/borg/testsuite/': No such file
	or directory

cinnamon-control-center-5.4.6-alt1
	[65/164] Compiling C object panels/region/libregion.so.p/cinnamon-region-panel-xkb.c.o
	FAILED: panels/region/libregion.so.p/cinnamon-region-panel-xkb.c.o
	cc -Ipanels/region/libregion.so.p -Ipanels/region -I../panels/region
	-I. -I.. -I/usr/include/glib-2.0 -I/usr/lib/glib-2.0/include -I/usr/include/gtk-3.0
	-I/usr/include/gio-unix-2.0 -I/usr/include/cairo -I/usr/include/pango-1.0
	-I/usr/include/harfbuzz -I/usr/include/atk-1.0 -I/usr/include/freetype2
	-I/usr/include/gdk-pixbuf-2.0 -I/usr/include/libpng16 -I/usr/include/cinnamon-desktop
	-I/usr/include/libxml2 -fdiagnostics-color=always -D_FILE_OFFSET_BITS=64 -Wall
	-Winvalid-pch -O2 -g -Wno-strict-aliasing -Wno-sign-compare -Wno-deprecated-declarations
	-Wno-deprecated -Wno-declaration-after-statement -DGLIB_DISABLE_DEPRECATION_WARNINGS
	-pipe -frecord-gcc-switches -Wall -g -O2 -flto=auto -march=i586 -mtune=generic -fPIC
	-pthread -MD -MQ panels/region/libregion.so.p/cinnamon-region-panel-xkb.c.o
	-MF panels/region/libregion.so.p/cinnamon-region-panel-xkb.c.o.d
	-o panels/region/libregion.so.p/cinnamon-region-panel-xkb.c.o -c
	../panels/region/cinnamon-region-panel-xkb.c
	../panels/region/cinnamon-region-panel-xkb.c: In function ‘reset_to_defaults’:
	../panels/region/cinnamon-region-panel-xkb.c:69:27: error:
	‘GKBD_DESKTOP_CONFIG_KEY_DEFAULT_GROUP’ undeclared (first use in this function)
	69 |			       GKBD_DESKTOP_CONFIG_KEY_DEFAULT_GROUP);
	--
	../panels/region/cinnamon-region-panel-xkb.c: In function ‘setup_xkb_tabs’:
	../panels/region/cinnamon-region-panel-xkb.c:130:63: error:
	‘GKBD_DESKTOP_CONFIG_KEY_GROUP_PER_WINDOW’ undeclared (first use in this function)
	130 |
	GKBD_DESKTOP_CONFIG_KEY_GROUP_PER_WINDOW));
	--
	[74/164] Compiling C object panels/region/libregion.so.p/cinnamon-region-panel-xkblt.c.o
	FAILED: panels/region/libregion.so.p/cinnamon-region-panel-xkblt.c.o
	cc -Ipanels/region/libregion.so.p -Ipanels/region -I../panels/region
	-I. -I.. -I/usr/include/glib-2.0 -I/usr/lib/glib-2.0/include -I/usr/include/gtk-3.0
	-I/usr/include/gio-unix-2.0 -I/usr/include/cairo -I/usr/include/pango-1.0
	-I/usr/include/harfbuzz -I/usr/include/atk-1.0 -I/usr/include/freetype2
	-I/usr/include/gdk-pixbuf-2.0 -I/usr/include/libpng16 -I/usr/include/cinnamon-desktop
	-I/usr/include/libxml2 -fdiagnostics-color=always -D_FILE_OFFSET_BITS=64 -Wall
	-Winvalid-pch -O2 -g -Wno-strict-aliasing -Wno-sign-compare -Wno-deprecated-declarations
	-Wno-deprecated -Wno-declaration-after-statement -DGLIB_DISABLE_DEPRECATION_WARNINGS
	-pipe -frecord-gcc-switches -Wall -g -O2 -flto=auto -march=i586 -mtune=generic -fPIC
	-pthread -MD -MQ panels/region/libregion.so.p/cinnamon-region-panel-xkblt.c.o
	-MF panels/region/libregion.so.p/cinnamon-region-panel-xkblt.c.o.d
	-o panels/region/libregion.so.p/cinnamon-region-panel-xkblt.c.o -c
	../panels/region/cinnamon-region-panel-xkblt.c
	../panels/region/cinnamon-region-panel-xkblt.c: In function
	‘xkb_layouts_get_selected_list’:
	../panels/region/cinnamon-region-panel-xkblt.c:97:39: error:
	‘GKBD_KEYBOARD_CONFIG_KEY_LAYOUTS’ undeclared (first use in this function)
	97 |					   GKBD_KEYBOARD_CONFIG_KEY_LAYOUTS);
	--
	../panels/region/cinnamon-region-panel-xkblt.c: In function ‘xkb_get_default_group’:
	../panels/region/cinnamon-region-panel-xkblt.c:110:36: error:
	‘GKBD_DESKTOP_CONFIG_KEY_DEFAULT_GROUP’ undeclared (first use in this function)
	110 |					 GKBD_DESKTOP_CONFIG_KEY_DEFAULT_GROUP);
	../panels/region/cinnamon-region-panel-xkblt.c: In function ‘xkb_save_default_group’:
	../panels/region/cinnamon-region-panel-xkblt.c:117:29: error:
	‘GKBD_DESKTOP_CONFIG_KEY_DEFAULT_GROUP’ undeclared (first use in this function)
	117 |				  GKBD_DESKTOP_CONFIG_KEY_DEFAULT_GROUP,
	--
	../panels/region/cinnamon-region-panel-xkblt.c: In function ‘update_layouts_list’:
	../panels/region/cinnamon-region-panel-xkb.h:73:32: error:
	‘GKBD_KEYBOARD_CONFIG_KEY_LAYOUTS’ undeclared (first use in this function)
	73 |				    GKBD_KEYBOARD_CONFIG_KEY_LAYOUTS, \
	--
	../panels/region/cinnamon-region-panel-xkblt.c: In function
	‘add_default_switcher_if_necessary’:
	../panels/region/cinnamon-region-panel-xkb.h:78:32: error:
	‘GKBD_KEYBOARD_CONFIG_KEY_OPTIONS’ undeclared (first use in this function)
	78 |				    GKBD_KEYBOARD_CONFIG_KEY_OPTIONS, \
	--
	../panels/region/cinnamon-region-panel-xkblt.c: In function ‘xkb_layouts_update_list’:
	../panels/region/cinnamon-region-panel-xkblt.c:457:26: error:
	‘GKBD_KEYBOARD_CONFIG_KEY_LAYOUTS’ undeclared (first use in this function)
	457 |	      if (strcmp (key, GKBD_KEYBOARD_CONFIG_KEY_LAYOUTS) == 0) {

firefox-103.0.1-alt1
	12:34.32 1 warning generated.
	12:34.32 gmake[4]: Leaving directory
	'/usr/src/RPM/BUILD/firefox-103.0.1/objdir/dom/bindings'
	12:34.32 gmake[2]: *** [/usr/src/RPM/BUILD/firefox-103.0.1/config/recurse.mk:34: compile]
	Error 2
	12:34.32 gmake[1]: *** [/usr/src/RPM/BUILD/firefox-103.0.1/config/rules.mk:361: default]
	Error 2
	12:34.32 gmake: *** [client.mk:63: build] Error 2
	12:34.35 88 compiler warnings present.
	12:34.37 Notification center failed: Install notify-send (usually part of the libnotify
	package) to get a notification when the build finishes.
	Config object not found by mach.
	Configure complete!
	Be sure to run |mach build| to pick up any changes

fprintd-1.94.2-alt1
	Full log written to /usr/src/RPM/BUILD/fprintd-1.94.2/i586-alt-linux/meson-logs/testlog.txt
	FAILED: meson-internal__test
	/usr/bin/meson test --no-rebuild --print-errorlogs

ghc8.6.4-sha-1.6.4.4-alt1
	+ ./Setup makefile -f cabal-rpm.mk
	unrecognised command: makefile (try --help)
	+ ./Setup build
	Preprocessing library for SHA-1.6.4.4..
	Building library for SHA-1.6.4.4..
	[1 of 1] Compiling Data.Digest.Pure.SHA ( src/Data/Digest/Pure/SHA.hs,
	dist/build/Data/Digest/Pure/SHA.o )
	ghc: out of memory (requested 1048576 bytes)
	error: Bad exit status from /usr/src/tmp/rpm-tmp.92588 (%build)
	RPM build errors:
	File /usr/src/RPM/SOURCES/ghc8.6.4-sha-1.6.4.4-alt1.patch is smaller than 8 bytes

jpcap-0.7-alt4
	rm libjpcap.so
	rm: cannot remove 'libjpcap.so': No such file or directory
	make: [Makefile:56: clean] Error 1 (ignored)
	--
	[javac] warning: [options] bootstrap class path not set in conjunction with -source 6
	[javac] error: Source option 6 is no longer supported. Use 7 or later.
	[javac] error: Target option 6 is no longer supported. Use 7 or later.
	BUILD FAILED
	/usr/src/RPM/BUILD/jpcap-0.7/build.xml:29: Compile failed; see the compiler error output
	for details.

libspice-gtk-0.40-alt1
	keycodemapdb| Subproject keycodemapdb finished.
	meson.build:53:0: ERROR: Sandbox violation: Tried to grab file keymap-gen from a nested
	subproject.
	A full log can be found at
	/usr/src/RPM/BUILD/libspice-gtk-0.40/i586-alt-linux/meson-logs/meson-log.txt

libvamp-2.10.0-alt1
	ld: ./libvamp-hostsdk.a: error adding symbols: no more archived files
	collect2: error: ld returned 1 exit status
	make: *** [Makefile:268: host/vamp-simple-host] Error 1
	--
	ld: ./libvamp-hostsdk.a: error adding symbols: no more archived files
	collect2: error: ld returned 1 exit status
	make: *** [Makefile:271: rdf/generator/vamp-rdf-template-generator] Error 1

lightdm-1.30.0-alt22
	# SKIP:  0
	# XFAIL: 0
	# FAIL:  1
	# XPASS: 0
	# ERROR: 0
	See tests/test-suite.log

perl-UML-Class-Simple-0.22-alt3
	Can't use string ("Template::Document") as a HASH ref while "strict refs" in use at
	/usr/lib/perl5/Template/Document.pm line 189.
	#   Failed test 'include01.png exists'
	#   at t/umlclass.t line 67.
	#   Failed test 'include01.png is nonempty'
	#   at t/umlclass.t line 68.
	Can't use string ("Template::Document") as a HASH ref while "strict refs" in use at
	/usr/lib/perl5/Template/Document.pm line 189.
	#   Failed test 'include03.png exists'
	#   at t/umlclass.t line 93.
	#   Failed test 'include03.png is nonempty'
	#   at t/umlclass.t line 94.
	--
	t/umlclass.t		  (Wstat: 1024 Tests: 93 Failed: 4)
	Failed tests:  15-16, 23-24
	Non-zero exit status: 4
	--
	Result: FAIL
	Failed 1/12 test programs. 4/150 subtests failed.
	make: *** [Makefile:799: test_dynamic] Error 4

python3-module-easyprocess-1.1-alt1
	tests/test_fast/test_proc.py::test_start3 PASSED			 [ 21%]
	tests/test_fast/test_proc.py::test_alive FAILED				 [ 23%]
	tests/test_fast/test_proc.py::test_std PASSED				 [ 26%]
	--
	tests/test_fast/test_proc.py::test_wrap PASSED				 [ 31%]
	tests/test_fast/test_proc.py::test_with FAILED				 [ 34%]
	tests/test_fast/test_proc.py::test_parse PASSED				 [ 36%]
	--
	=========================== short test summary info ============================
	FAILED tests/test_fast/test_proc.py::test_alive - assert False
	FAILED tests/test_fast/test_proc.py::test_with - assert False
	=================== 2 failed, 36 passed in 80.37s (0:01:20) ====================

python3-module-pytz-deprecation-shim-0.1.0.post0-alt1
	=========================== short test summary info ============================
	FAILED tests/test_pytz_equivalent.py::test_localize_explicit_is_dst - Asserti...
	FAILED tests/test_pytz_equivalent.py::test_localize_is_dst_none - AssertionError
	FAILED tests/test_pytz_equivalent.py::test_normalize_same_zone - AssertionError
	================== 3 failed, 417 passed, 62 warnings in 3.53s ==================

seamonkey-1:2.53.13-alt1
	18:49.08 gmake[4]: Leaving directory
	'/usr/src/RPM/BUILD/seamonkey-2.53.13/objdir/toolkit/library/rust'
	18:49.08 gmake[3]: *** [/usr/src/RPM/BUILD/seamonkey-2.53.13/config/recurse.mk:74:
	toolkit/library/rust/target] Error 2
	18:49.08 gmake[3]: Leaving directory '/usr/src/RPM/BUILD/seamonkey-2.53.13/objdir'
	18:49.08 gmake[2]: *** [/usr/src/RPM/BUILD/seamonkey-2.53.13/config/recurse.mk:34:
	compile] Error 2
	18:49.08 gmake[2]: Leaving directory '/usr/src/RPM/BUILD/seamonkey-2.53.13/objdir'
	18:49.08 gmake[1]: *** [/usr/src/RPM/BUILD/seamonkey-2.53.13/config/rules.mk:385:
	default] Error 2
	18:49.08 gmake[1]: Leaving directory '/usr/src/RPM/BUILD/seamonkey-2.53.13/objdir'
	18:49.08 gmake: *** [client.mk:119: build] Error 2
	18:49.08 gmake: Leaving directory '/usr/src/RPM/BUILD/seamonkey-2.53.13'
	18:49.09 99 compiler warnings present.

thunderbird-91.10.0-alt1
	1:20.82 1 warning generated.
	1:20.82 gmake[4]: Leaving directory
	'/usr/src/RPM/BUILD/thunderbird-91.10.0/objdir/comm/ldap/xpcom/src'
	1:20.82 gmake[2]: *** [/usr/src/RPM/BUILD/thunderbird-91.10.0/config/recurse.mk:34:
	compile] Error 2
	1:20.82 gmake[1]: *** [/usr/src/RPM/BUILD/thunderbird-91.10.0/config/rules.mk:355:
	default] Error 2
	1:20.82 gmake: *** [client.mk:65: build] Error 2
	1:20.82 gmake: Leaving directory '/usr/src/RPM/BUILD/thunderbird-91.10.0'
	1:20.84 58 compiler warnings present.
	error: Bad exit status from /usr/src/tmp/rpm-tmp.88835 (%build)
	RPM build errors:
	Unparseable macro: % for a library

trove4j-3.0.3-alt2
	[javac] warning: [options] bootstrap class path not set in conjunction with -source 6
	[javac] error: Source option 6 is no longer supported. Use 7 or later.
	[javac] error: Target option 6 is no longer supported. Use 7 or later.
	BUILD FAILED
	/usr/src/RPM/BUILD/trove4j-3.0.3/build.xml:321: Compile failed; see the compiler error
	output for details.

	13 error logs REMOVED from the list
glibc-6:2.35.0.6.491f2e-alt1
libdbus-c++-0.9.0-alt2
libffado-2.4.1-alt4
lua-lunit-0.5-alt2
meschach-1.2-alt1.b.3
python3-module-amqpy-0.12.4-alt2.git20160226
python3-module-hatch-vcs-0.2.0-alt1
python3-module-pyfakefs-4.5.6-alt1
python3-module-vispy-0.6.6-alt1
ring-project-20211223-alt2
scalacheck-1.15.4-alt1_2jpp11
texlive-2021-alt3_3
zeromq-4.3.4-alt1

Total 109 error logs.


Sisyphus-cybertalk