[cyber] I: Sisyphus-20220408 x86_64 beehive_status: +6 -49 (115)
ALT beekeeper
hiver на altlinux.org
Пт Апр 8 05:59:05 MSK 2022
6 NEW error logs
ceph-16.2.7-alt1
431 | #if !__GLIBC_USE (DEPRECATED_SCANF) && !defined __LDBL_COMPAT \
/usr/include/stdio.h:595:17: error: missing binary operator before token "("
595 | #if __GLIBC_USE (DEPRECATED_GETS)
/usr/include/stdio.h:621:43: error: missing binary operator before token "("
621 | #if defined __USE_XOPEN2K8 || __GLIBC_USE (LIB_EXT2)
--
from /usr/src/tmp/ceph-buildroot/usr/include/rbd/librbd.hpp:22:
/usr/include/bits/libc-header-start.h:74:17: error: missing binary operator before token
"("
74 | #if __GLIBC_USE (IEC_60559_BFP_EXT) || __GLIBC_USE (ISOC2X)
/usr/include/bits/libc-header-start.h:80:17: error: missing binary operator before token
"("
80 | #if __GLIBC_USE (IEC_60559_BFP_EXT) || defined __STDC_WANT_IEC_60559_EXT__
/usr/include/bits/libc-header-start.h:97:17: error: missing binary operator before token
"("
97 | #if __GLIBC_USE (IEC_60559_FUNCS_EXT) || __GLIBC_USE (ISOC2X)
--
from /usr/src/tmp/ceph-buildroot/usr/include/rbd/librbd.hpp:22:
/usr/include/limits.h:145:17: error: missing binary operator before token "("
145 | #if __GLIBC_USE (IEC_60559_BFP_EXT_C2X)
/usr/include/limits.h:184:17: error: missing binary operator before token "("
184 | #if __GLIBC_USE (ISOC2X)
--
from /usr/src/tmp/ceph-buildroot/usr/include/rbd/librbd.hpp:22:
/usr/include/sys/types.h:163:19: error: missing binary operator before token "("
163 | #if __GNUC_PREREQ (2, 7)
--
from /usr/src/tmp/ceph-buildroot/usr/include/rbd/librbd.hpp:22:
/usr/include/bits/libc-header-start.h:74:17: error: missing binary operator before token
"("
74 | #if __GLIBC_USE (IEC_60559_BFP_EXT) || __GLIBC_USE (ISOC2X)
/usr/include/bits/libc-header-start.h:80:17: error: missing binary operator before token
"("
80 | #if __GLIBC_USE (IEC_60559_BFP_EXT) || defined __STDC_WANT_IEC_60559_EXT__
curl-7.82.0-alt1
TESTDONE: 1199 tests out of 1200 reported OK: 99%
TESTFAIL: These test cases failed: 587
make[1]: *** [Makefile:815: full-test] Error 1
jicofo-1.1-alt0.4
[INFO] ------------------------------------------------------------------------
[INFO] BUILD FAILURE
[INFO] ------------------------------------------------------------------------
[INFO] Total time: 0.382 s
[INFO] Finished at: 2022-04-08T02:37:29Z
[INFO] ------------------------------------------------------------------------
[ERROR] Malformed \uxxxx encoding.
[ERROR]
[ERROR] To see the full stack trace of the errors, re-run Maven with the -e switch.
[ERROR] Re-run Maven using the -X switch to enable full debug logging.
nemo-extensions-5.2.1-alt1
+ /usr/bin/python3 setup.py build
error: Multiple top-level packages discovered in a flat-layout: ['po', 'debian'].
To avoid accidental inclusion of unwanted files or directories,
quilt-0.67-alt1
make: Leaving directory '/usr/src/RPM/BUILD/quilt-0.67-alt1'
make: Entering directory '/usr/src/RPM/BUILD/quilt-0.67-alt1'
[three.test]
54 commands (54 passed, 0 failed)
make: Leaving directory '/usr/src/RPM/BUILD/quilt-0.67-alt1'
make: Entering directory '/usr/src/RPM/BUILD/quilt-0.67-alt1'
[two.test]
57 commands (57 passed, 0 failed)
make: Leaving directory '/usr/src/RPM/BUILD/quilt-0.67-alt1'
make: Target 'check' not remade because of errors.
virt-manager-4.0.0-alt2
+ python3 setup.py configure
error: Multiple top-level packages discovered in a flat-layout: ['ui', 'po', 'man',
'data', 'virtinst', 'virtManager'].
To avoid accidental inclusion of unwanted files or directories,
49 error logs REMOVED from the list
clisp-1:2.49.92-alt2
eid-mw-5.0.8-alt1
firefox-TabMixPlus-0.4.1.7.1-alt1
firefox-adblock_plus-2.7.3-alt1
firefox-addon-noscript-11.2.11-alt1
firefox-anonymox-2.4.3-alt1
firefox-certificate_watch-1.12.0-alt1
firefox-dark_reader-4.9.45-alt1
firefox-deepdark-10.3.8-alt1
firefox-duckduckgo_plus-2022.1.24-alt1
firefox-esr-noscript-5.1.8.4-alt2
firefox-exit_button-0.4.3-alt2
firefox-export_tabs_urls-0.2.12-alt1
firefox-firebug-1:2.0.16-alt1
firefox-flashgot-1.5.5.94-alt1
firefox-foxyproxy_standard-7.5.1-alt1
firefox-fullscreen-kiosk-1.0.1-alt11
firefox-gismeteo-5.0.0.6-alt2.1
firefox-gnome_shell_integration-10.1-alt1
firefox-gsconnect-8.0-alt1
firefox-hybridfox-1.7.000119-alt5
firefox-livejournal_addons-9.5-alt4
firefox-morpheus-0.2.6.1.1-alt1
firefox-mysessions-2021.6.0-alt1
firefox-privacy_settings-0.3.7-alt1
firefox-r-kiosk-0.9.0.1-alt3
firefox-save_as_ebook-1.4.2-alt1
firefox-save_pdf-0.1-alt1
firefox-tab2qr-3.0.0-alt1
firefox-tridactyl-1.22.0-alt1
firefox-ublock_origin-1.40.8-alt1
firefox-ubo_scope-0.1.12-alt1
firefox-umatrix-1.4.4-alt1
firefox-urls_list-0.5.0-alt1
firefox-video_downloadhelper-7.6.0-alt1
firefox-vkontaktetoolbar-0.6.1-alt1
firefox-webdeveloper-1:2.0.5-alt1
firefox-webscrapbook-1.2.0-alt1
gnome-books-40.0-alt2
libvamp-2.10.0-alt1
litmus-0.14.0-alt1.git.9fbc73d
openFPGALoader-0.8.0-alt3
perl-Server-Starter-0.35-alt1.1
python3-module-RestrictedPython-5.1-alt1
python3-module-aiohttp_jinja2-1:0.13.0-alt3
python3-module-gettext-3.0-alt2
python3-module-joblib-1.1.0-alt1
python3-module-kiwisolver-1.3.2-alt1
sqlite3-3.38.2-alt1
Total 115 error logs.
Подробная информация о списке рассылки Sisyphus-cybertalk