[cyber] I: Sisyphus-20210915 x86_64 beehive_status: +6 -10 (414)
ALT beekeeper
hiver на altlinux.org
Ср Сен 15 09:54:47 MSK 2021
6 NEW error logs
bear-3.0.13-alt1
/usr/src/RPM/BUILD/bear-3.0.13/source/citnames/source/Output.cc: In function 'void
cs::from_json(const json&, cs::Entry&)':
/usr/src/RPM/BUILD/bear-3.0.13/source/citnames/source/Output.cc:187:101: error: no matching
function for call to 'nlohmann::detail::out_of_range::create(int, const char [39])'
187 | throw nlohmann::json::out_of_range::create(403, "key 'command' or
'arguments' not found");
meschach-1.2-alt1.b.3
Verifying ELF objects in /usr/src/tmp/meschach-buildroot
(arch=normal,fhs=normal,lfs=relaxed,lint=relaxed,rpath=normal,stack=normal,textrel=normal,unresolved=normal)
verify-elf: ERROR: ./usr/lib64/libmeschach.so.0: undefined symbol: restart
verify-elf: ERROR: ./usr/lib64/libmeschach.so.0: undefined symbol: m_ident
verify-elf: ERROR: ./usr/lib64/libmeschach.so.0: undefined symbol: get_row
verify-elf: ERROR: ./usr/lib64/libmeschach.so.0: undefined symbol: v_mltadd
verify-elf: ERROR: ./usr/lib64/libmeschach.so.0: undefined symbol: __zero__
verify-elf: ERROR: ./usr/lib64/libmeschach.so.0: undefined symbol: m_transp
verify-elf: ERROR: ./usr/lib64/libmeschach.so.0: undefined symbol: mrand
verify-elf: ERROR: ./usr/lib64/libmeschach.so.0: undefined symbol: v_sub
verify-elf: ERROR: ./usr/lib64/libmeschach.so.0: undefined symbol: m_resize
verify-elf: ERROR: ./usr/lib64/libmeschach.so.0: undefined symbol: _in_prod
verify-elf: ERROR: ./usr/lib64/libmeschach.so.0: undefined symbol: px_get
openldap-2.4.59-alt1
Waiting 20 seconds for lockout to reset...
Testing password expiration
Waiting 20 seconds for password to expire...
Password expiration test failed
>>>>> test022-ppolicy failed for bdb
(exit 1)
make[2]: *** [Makefile:293: bdb-mod] Error 1
make[2]: Leaving directory '/usr/src/RPM/BUILD/openldap-2.4.59/tests'
make[1]: *** [Makefile:278: test] Error 2
make: *** [Makefile:290: test] Error 2
php7-memcache-4.0.5.2-alt7.4.23.alt1
Time taken : 11 seconds
FAILED TEST SUMMARY
memcache->increment()/decrement() with multiple keys [tests/040.phpt]
python3-module-Quamash-0.6.1-alt2
self._warn_or_fail_if_strict(f"Unknown config option: {key}\n")
tests/test_qeventloop.py:174
/usr/src/RPM/BUILD/python3-module-Quamash-0.6.1/tests/test_qeventloop.py:174:
PytestUnknownMarkWarning: Unknown pytest.mark.raises - is this a typo?
You can register custom marks to avoid this warning - for details, see
https://docs.pytest.org/en/stable/mark.html
@pytest.mark.raises(ExceptionTester)
quamash/__init__.py: 2 warnings
tests/test_qeventloop.py: 21 warnings
/usr/src/RPM/BUILD/python3-module-Quamash-0.6.1/quamash/__init__.py:183:
DeprecationWarning: an integer is required (got type float). Implicit conversion to
integers using __int__ is deprecated, and may be removed in a future version of Python.
timerid = self.startTimer(delay * 1000)
-- Docs: https://docs.pytest.org/en/stable/warnings.html
============== 1 failed, 44 passed, 25 warnings, 1 error in 3.27s ==============
python3-module-pytest-6.2.5-alt1
=========================== short test summary info ============================
FAILED testing/test_debugging.py::TestPDB::test_pdb_and_capsys - pexpect.exce...
====== 1 failed, 3019 passed, 27 skipped, 9 xfailed in 254.20s (0:04:14) =======
ERROR: InvocationError for command
/usr/src/RPM/BUILD/python3-module-pytest-6.2.5/.tox/py3/bin/pytest (exited with code 1)
py3 finish: run-test after 256.10 seconds
--
___________________________________ summary ____________________________________
ERROR: py3: commands failed
cleanup
/usr/src/RPM/BUILD/python3-module-pytest-6.2.5/.tox/.tmp/package/1/pytest-6.2.5.tar.gz
10 error logs REMOVED from the list
ModemManager-1.16.10-alt1
grace-5.1.25-alt5
gsoap-2.8.102-alt1
hfsutils-3.2.6-alt1
hts_engine-1.03-alt1.qa1
libmtxclient-0.4.1-alt2
mariadb-10.5.11-alt1
qxmledit-0.9.16-alt1
racket-7.3-alt2
tome-2.3.5-alt3
Total 414 error logs.
Подробная информация о списке рассылки Sisyphus-cybertalk