[cyber] I: Sisyphus-20211016 x86_64 beehive_status: +5 -22 (296)
ALT beekeeper
hiver на altlinux.org
Сб Окт 16 09:54:44 MSK 2021
5 NEW error logs
guile22-2.2.7-alt1
Running 00-socket.test
hasher-priv: master: idle time limit (3600 seconds) exceeded
ibus-1.5.25-alt1
117 | __atomic_load (gapg_temp_atomic, &gapg_temp_newval, __ATOMIC_SEQ_CST); \
/usr/include/glib-2.0/glib/gthread.h:260:7: note: in expansion of macro
'g_atomic_pointer_get'
260 | (!g_atomic_pointer_get (location) && \
keybindingmanager.c:1348:13: note: in expansion of macro 'g_once_init_enter'
1348 | if (g_once_init_enter (&keybinding_manager_type_id__volatile)) {
make[3]: Leaving directory '/usr/src/RPM/BUILD/ibus-1.5.25/ui/gtk3'
rm ibus-emoji.7
make[2]: *** [Makefile:511: all-recursive] Error 1
make[1]: *** [Makefile:688: all-recursive] Error 1
make: *** [Makefile:595: all] Error 2
libgdk-pixbuf-2.42.6-alt1
21/23 gdk-pixbuf:security / cve-2015-4491 OK 0.91s
22/23 gdk-pixbuf:format / pixbuf-short-gif-write OK 0.72s
23/23 gdk-pixbuf:conform+slow / pixbuf-fail OK 3.42s
Ok: 22
Expected Fail: 0
Fail: 1
Unexpected Pass: 0
Skipped: 0
Timeout: 0
Full log written to
/usr/src/RPM/BUILD/gdk-pixbuf-2.42.6/x86_64-alt-linux/meson-logs/testlog.txt
meschach-1.2-alt1.b.3
Verifying ELF objects in /usr/src/tmp/meschach-buildroot
(arch=normal,fhs=normal,lfs=relaxed,lint=relaxed,rpath=normal,stack=normal,textrel=normal,unresolved=normal)
verify-elf: ERROR: ./usr/lib64/libmeschach.so.0: undefined symbol: m_ident
verify-elf: ERROR: ./usr/lib64/libmeschach.so.0: undefined symbol: get_row
verify-elf: ERROR: ./usr/lib64/libmeschach.so.0: undefined symbol: __zero__
verify-elf: ERROR: ./usr/lib64/libmeschach.so.0: undefined symbol: mrand
verify-elf: ERROR: ./usr/lib64/libmeschach.so.0: undefined symbol: __sub__
verify-elf: ERROR: ./usr/lib64/libmeschach.so.0: undefined symbol: __add__
verify-elf: ERROR: ./usr/lib64/libmeschach.so.0: undefined symbol: px_ident
verify-elf: ERROR: ./usr/lib64/libmeschach.so.0: undefined symbol: iv_free
verify-elf: ERROR: ./usr/lib64/libmeschach.so.0: undefined symbol: iv_copy
verify-elf: ERROR: ./usr/lib64/libmeschach.so.0: undefined symbol: m_zero
verify-elf: ERROR: ./usr/lib64/libmeschach.so.0: undefined symbol: iv_sort
tome-2.3.5-alt3
powers.c: In function 'power_activate':
powers.c:101:13: internal compiler error: Segmentation fault
101 | static void power_activate(int power)
--
See <http://bugzilla.altlinux.org> for instructions.
lto-wrapper: fatal error: x86_64-alt-linux-gcc returned 1 exit status
compilation terminated.
ld: error: lto-wrapper failed
collect2: error: ld returned 1 exit status
make: *** [makefile.std:458: tome] Error 1
22 error logs REMOVED from the list
bonnie++-2.00a-alt1
buildcache-0.26.1-alt1
cryptote-0.6.0-alt2
directfb-1.1.0-alt6
ensmallen-2.14.2-alt1_1
gawk-5.1.0.0.213.d04f-alt1
gnucash-4.6-alt1
hammerhead-1:2.1.4-alt2
libspf2-1.2.10-alt4
litmus-0.14.0-alt1.git.9fbc73d
mailutils-3.12-alt1
passenger-6.0.4-alt1.1
pear-Net_SMPP_Client-0.4.1-alt1
perl-Net-SIP-0.832-alt1
plasma5-workspace-1:5.22.5-alt5
quilt-0.66-alt2
sbcl-2.0.4-alt1
speech-dispatcher-0.10.2-alt1
tidyp-1.04-alt1
tokyocabinet-1.4.47-alt2
tokyodystopia-0.9.13-alt2.qa1
tokyotyrant-1.1.40-alt1.2
Total 296 error logs.
Подробная информация о списке рассылки Sisyphus-cybertalk