[cyber] I: p9-20210530 i586 beehive_status: +8 -5 (111)
ALT beekeeper
hiver на altlinux.org
Вс Май 30 18:13:26 MSK 2021
8 NEW error logs
automake_1.11-1.11.6-alt9
checking for upc... no
configure: error: no Unified Parallel C compiler was found
+ exit_status=77
--
+ exit 77
1 of 893 tests failed
(58 tests were not run)
curl-7.76.0-alt1
TESTDONE: 1122 tests out of 1124 reported OK: 99%
TESTFAIL: These test cases failed: 587 588
make[1]: *** [Makefile:805: full-test] Error 1
custodia-0.6.0-alt6
self.fail(str(exc))
E AssertionError: HTTPSConnectionPool(host='localhost', port=39979): Max retries
exceeded with url: /forwarder/test/ (Caused by SSLError(SSLError(1, '[SSL] tlsv13 alert
certificate required (_ssl.c:2508)')))
==================== 1 failed, 161 passed in 38.61 seconds =====================
ERROR: InvocationError for command /usr/src/RPM/BUILD/custodia-0.6.0/.tox/py37/bin/python
-m coverage run --parallel -m pytest --capture=no --strict (exited with code 1)
ERROR: invocation failed (exit code 1)
Б°√ FAIL py37 in 48.53 seconds
___________________________________ summary ____________________________________
ERROR: py37: parallel child exit code 1
perl-HTML-Widget-1.11-alt3
Compilation failed in require at t/element_custom_namespace.t line 6.
BEGIN failed--compilation aborted at t/element_custom_namespace.t line 6.
# Looks like your test exited with 255 before it could output anything.
--
Compilation failed in require at t/element_hidden.t line 6.
BEGIN failed--compilation aborted at t/element_hidden.t line 6.
# Looks like your test exited with 255 before it could output anything.
--
Compilation failed in require at t/element_select.t line 6.
BEGIN failed--compilation aborted at t/element_select.t line 6.
# Looks like your test exited with 255 before it could output anything.
--
Compilation failed in require at t/element_span.t line 6.
BEGIN failed--compilation aborted at t/element_span.t line 6.
# Looks like your test exited with 255 before it could output anything.
--
Compilation failed in require at t/element_textfield.t line 6.
BEGIN failed--compilation aborted at t/element_textfield.t line 6.
# Looks like your test exited with 255 before it could output anything.
--
Compilation failed in require at t/filter_callback.t line 6.
BEGIN failed--compilation aborted at t/filter_callback.t line 6.
# Looks like your test exited with 255 before it could output anything.
--
Compilation failed in require at t/filter_uppercase.t line 6.
BEGIN failed--compilation aborted at t/filter_uppercase.t line 6.
# Looks like your test exited with 255 before it could output anything.
--
Compilation failed in require at t/get_elements.t line 6.
BEGIN failed--compilation aborted at t/get_elements.t line 6.
# Looks like your test exited with 255 before it could output anything.
--
Compilation failed in require at t/get_filter.t line 6.
BEGIN failed--compilation aborted at t/get_filter.t line 6.
# Looks like your test exited with 255 before it could output anything.
--
Compilation failed in require at t/retain_default.t line 6.
BEGIN failed--compilation aborted at t/retain_default.t line 6.
# Looks like your test exited with 255 before it could output anything.
perl-IO-Event-0.813-alt2
Result: FAIL
Failed 1/12 test programs. 0/920 subtests failed.
make: *** [Makefile:780: test_dynamic] Error 255
perl-Net-Ping-2.72-alt1
t/150_syn_inst.t ...... ok
# Failed test 'Make sure it died for a good excuse'
# at t/190_alarm.t line 54.
--
t/190_alarm.t (Wstat: 256 Tests: 6 Failed: 1)
Failed test: 6
Non-zero exit status: 1
--
Result: FAIL
Failed 1/17 test programs. 1/66 subtests failed.
make: *** [Makefile:784: test_dynamic] Error 255
quilt-0.66-alt1
make: Leaving directory '/usr/src/RPM/BUILD/quilt-0.66-alt1'
make: Entering directory '/usr/src/RPM/BUILD/quilt-0.66-alt1'
[three.test]
66 commands (66 passed, 0 failed)
make: Leaving directory '/usr/src/RPM/BUILD/quilt-0.66-alt1'
make: Entering directory '/usr/src/RPM/BUILD/quilt-0.66-alt1'
[two.test]
57 commands (57 passed, 0 failed)
make: Leaving directory '/usr/src/RPM/BUILD/quilt-0.66-alt1'
make: Target 'check' not remade because of errors.
vi-traditional-050325-alt1
/usr/bin/ld.default: cannot find -luxre
collect2: error: ld returned 1 exit status
make: *** [Makefile:267: ex] Error 1
5 error logs REMOVED from the list
glassfish-hk2-2.4.0-alt1_10jpp8
jed-2:0.99.19-alt2.qa2.1
python-module-pytest-cov-2.7.1-alt1
transgui-5.18.0-alt3
util-linux-2.33.2-alt2
Total 111 error logs.
Подробная информация о списке рассылки Sisyphus-cybertalk