[cyber] I: Sisyphus-20210118 i586 beehive_status: +7 -11 (495)

ALT beekeeper hiver altlinux.org
18 15:47:00 MSK 2021


	7 NEW error logs

atlas-3.9.35-alt1.qa1
	/usr/src/RPM/BUILD/ATLAS/BUILD/..//include/atlas_mmparse.h: In function 'Parse
	hasher-priv: master: idle time limit (3600 seconds) exceeded

cilk-5.4.6-alt11
	perl -I. ./bfnnconv.pl ./cilk-faq.bfnn
	no ./cilk-faq.xrefdb (No such file or directory) at ./bfnnconv.pl line 43.
	S0	    
S1		 
Q1.1		
Q1.2	       
Q1.3	      
Q1.4	     
Q1.5
	
Q1.6	       
Q1.7	      
Q1.8	     
S2	  
Q2.1		 
Q2.2
	
Q2.3	       
Q2.4	      
S3	   
Q3.1	  
Q3.2		 
Q3.3
	
Q3.4	       
unknown question `compile' at ./bfnnconv.pl line 221, <> line 263.
	--
	libtool: install: /usr/libexec/rpm-build/install -p .libs/libcilk.g.so.0.0.0
	/usr/src/tmp/cilk-buildroot/usr/lib/libcilk.g.so.0.0.0
	/bin/install: cannot stat '.libs/libcilk.g.so.0.0.0': No such file or directory
	make[2]: *** [Makefile:565: install-libLTLIBRARIES] Error 1

perl-Time-Format_XS-1.03-alt5
	t/DateTime.t .. ok
	#   Failed test 'm test: Hour12:'
	#   at t/func.t line 116.
	--
	t/func.t    (Wstat: 256 Tests: 80 Failed: 1)
	Failed test:  77
	Non-zero exit status: 1
	--
	Result: FAIL
	Failed 1/4 test programs. 1/414 subtests failed.
	make: *** [Makefile:959: test_dynamic] Error 255

python3-module-pexpect-4.8.0-alt1
	+ command)
	E	    ValueError: Continuation prompt found - input was incomplete:
	E	    echo $HOME
	--
	=========================== short test summary info ============================
	FAILED tests/test_replwrap.py::REPLWrapTestCase::test_existing_spawn - ValueE...
	============ 1 failed, 233 passed, 13 warnings in 196.64s (0:03:16) ============

python3-module-virtualenv-20.1.0-alt1
	SKIPPED [1] tests/unit/activation/conftest.py:249: Csh(
	version=FileNotFoundError(2, 'No such file or directory'),
	creator=CPython3Posix(dest=/usr/src/tmp/pytest-of-builder/pytest-0/popen-gw0/activation-tester-env0/e-$
	èрт🚒♞中片-j, clear=False, global=False),
	interpreter=PythonInfo(spec=CPython3.8.6.final.0-32, system=/usr/bin/python3.8,
	exe=/usr/src/RPM/BUILD/python3-module-virtualenv-20.1.0/.tox/py3/bin/python,
	platform=linux, version='3.8.6 (default, Oct  2 2020, 00:06:33) \n[GCC 9.3.1 20200518
	(ALT Sisyphus 9.3.1-alt1)]', encoding_fs_io=utf-8-utf-8)) is not available due [Errno 2]
	No such file or directory: 'csh'
	SKIPPED [1] tests/unit/activation/conftest.py:249: Fish(
	version=FileNotFoundError(2, 'No such file or directory'),
	creator=CPython3Posix(dest=/usr/src/tmp/pytest-of-builder/pytest-0/popen-gw0/activation-tester-env0/e-$
	èрт🚒♞中片-j, clear=False, global=False),
	interpreter=PythonInfo(spec=CPython3.8.6.final.0-32, system=/usr/bin/python3.8,
	exe=/usr/src/RPM/BUILD/python3-module-virtualenv-20.1.0/.tox/py3/bin/python,
	platform=linux, version='3.8.6 (default, Oct  2 2020, 00:06:33) \n[GCC 9.3.1 20200518
	(ALT Sisyphus 9.3.1-alt1)]', encoding_fs_io=utf-8-utf-8)) is not available due [Errno 2]
	No such file or directory: 'fish'
	SKIPPED [1] tests/unit/create/test_creator.py:302: venv without clear might fail
	--
	SKIPPED [1] tests/unit/activation/conftest.py:249: Fish(
	version=FileNotFoundError(2, 'No such file or directory'),
	creator=CPython3Posix(dest=/usr/src/tmp/pytest-of-builder/pytest-0/popen-gw5/activation-tester-env0/e-$
	èрт🚒♞中片-j, clear=False, global=False),
	interpreter=PythonInfo(spec=CPython3.8.6.final.0-32, system=/usr/bin/python3.8,
	exe=/usr/src/RPM/BUILD/python3-module-virtualenv-20.1.0/.tox/py3/bin/python,
	platform=linux, version='3.8.6 (default, Oct  2 2020, 00:06:33) \n[GCC 9.3.1 20200518
	(ALT Sisyphus 9.3.1-alt1)]', encoding_fs_io=utf-8-utf-8)) is not available due [Errno 2]
	No such file or directory: 'fish'
	SKIPPED [1] tests/unit/test_util.py:19: subprocess patch only applied on Windows python2
	--
	SKIPPED [1] tests/unit/activation/conftest.py:249: Csh(
	version=FileNotFoundError(2, 'No such file or directory'),
	creator=CPython3Posix(dest=/usr/src/tmp/pytest-of-builder/pytest-0/popen-gw7/activation-tester-env0/e-$
	èрт🚒♞中片-j, clear=False, global=False),
	interpreter=PythonInfo(spec=CPython3.8.6.final.0-32, system=/usr/bin/python3.8,
	exe=/usr/src/RPM/BUILD/python3-module-virtualenv-20.1.0/.tox/py3/bin/python,
	platform=linux, version='3.8.6 (default, Oct  2 2020, 00:06:33) \n[GCC 9.3.1 20200518
	(ALT Sisyphus 9.3.1-alt1)]', encoding_fs_io=utf-8-utf-8)) is not available due [Errno 2]
	No such file or directory: 'csh'
	SKIPPED [1] tests/unit/activation/conftest.py:249: PowerShell(
	version=FileNotFoundError(2, 'No such file or directory'),
	creator=CPython3Posix(dest=/usr/src/tmp/pytest-of-builder/pytest-0/popen-gw1/activation-tester-env0/e-$
	èрт🚒♞中片-j, clear=False, global=False),
	interpreter=PythonInfo(spec=CPython3.8.6.final.0-32, system=/usr/bin/python3.8,
	exe=/usr/src/RPM/BUILD/python3-module-virtualenv-20.1.0/.tox/py3/bin/python,
	platform=linux, version='3.8.6 (default, Oct  2 2020, 00:06:33) \n[GCC 9.3.1 20200518
	(ALT Sisyphus 9.3.1-alt1)]', encoding_fs_io=utf-8-utf-8)) is not available due [Errno 2]
	No such file or directory: 'pwsh'
	SKIPPED [2] tests/integration/test_zipapp.py:100: Requires internet connection

reflections-0.9.10-alt1_8jpp8
	Selecting slf4j for 'mvn(org.slf4j:slf4j-simple)'
	E: Couldn't find package openjfx
	hsh-install: Failed to calculate package file list.

sssd-2.4.0-alt2
	PASS: test_ad_subdom
	FAIL: test_ipa_subdom_server
	PASS: test_sssd_krb5_localauth_plugin
	--
	# SKIP:  2
	# XFAIL: 0
	# FAIL:  1
	# XPASS: 0
	# ERROR: 0
	.. contents:: :depth: 2
	FAIL: test_ipa_subdom_server
	[==========] Running 13 test(s).
	--
	[ RUN	   ] test_ipa_server_trust_oneway_init
	[  ERROR   ] --- test_ctx->ipa_ctx->server_mode->trusts
	[   LINE   ] --- src/tests/cmocka/test_ipa_subdomains_server.c:907: error: Failure!
	[  FAILED  ] test_ipa_server_trust_oneway_init
	[ RUN	   ] test_ipa_server_trust_init
	--
	[  PASSED  ] 12 test(s).
	[  FAILED  ] 1 test(s), listed below:
	[  FAILED  ] test_ipa_server_trust_oneway_init
	1 FAILED TEST(S)

	11 error logs REMOVED from the list
automake_1.11-1.11.6-alt9
chromium-87.0.4280.141-alt2
chromium-gost-87.0.4280.141-alt1
guacamole-server-1.2.0-alt2
kdevelop5-5.5.2-alt1
librabbitmq-c-0.9.0-alt1
mockito-0:2.23.9-alt1_6jpp8
openjfx-8.0.202-alt1_8.b07jpp8
python3-module-apptools-4.5.0-alt1
sbcl-2.0.4-alt1
stress-ng-0.11.23-alt1

Total 495 error logs.


Sisyphus-cybertalk