[cyber] I: Sisyphus-20210428 x86_64 beehive_status: +11 -12 (45)

ALT beekeeper hiver altlinux.org
28 10:13:57 MSK 2021


	11 NEW error logs

Perlbal-1.80-alt1
	Result: FAIL
	Failed 1/25 test programs. 0/461 subtests failed.
	make: *** [Makefile:852: test_dynamic] Error 255

bcc-0.19.0-alt1
	In file included from map_helpers.c:7:
	./map_helpers.h:6:10: fatal error: 'bpf/bpf.h' file not found
	#include <bpf/bpf.h>

cilk-5.4.6-alt11
	perl -I. ./bfnnconv.pl ./cilk-faq.bfnn
	no ./cilk-faq.xrefdb (No such file or directory) at ./bfnnconv.pl line 43.
	S0	    
S1		 
Q1.1		
Q1.2	       
Q1.3	      
Q1.4	     
Q1.5
	
Q1.6	       
Q1.7	      
Q1.8	     
S2	  
Q2.1		 
Q2.2
	
Q2.3	       
Q2.4	      
S3	   
Q3.1	  
Q3.2		 
Q3.3
	
Q3.4	       
unknown question `compile' at ./bfnnconv.pl line 221, <> line 263.
	--
	libtool: install: /usr/libexec/rpm-build/install -p .libs/libcilk.p.so.0.0.0
	/usr/src/tmp/cilk-buildroot/usr/lib64/libcilk.p.so.0.0.0
	/bin/install: cannot stat '.libs/libcilk.p.so.0.0.0': No such file or directory
	make[2]: *** [Makefile:565: install-libLTLIBRARIES] Error 1

custodia-0.6.0-alt6
	using tox.ini: /usr/src/RPM/BUILD/custodia-0.6.0/tox.ini (pid 923058)
	'exit code 1' cmd '/usr/bin/python2.7' out '' err 'Traceback (most recent call last):\n
	File "/usr/lib/python3/site-packages/tox/helper/get_version.py", line 3, in <module>\n
	import json\nImportError: No module named json\n'
	using tox-3.20.1 from /usr/lib/python3/site-packages/tox/__init__.py (pid 923058)
	--
	using tox.ini: /usr/src/RPM/BUILD/custodia-0.6.0/tox.ini (pid 926767)
	'exit code 1' cmd '/usr/bin/python2.7' out '' err 'Traceback (most recent call last):\n
	File "/usr/lib/python3/site-packages/tox/helper/get_version.py", line 3, in <module>\n
	import json\nImportError: No module named json\n'
	using tox-3.20.1 from /usr/lib/python3/site-packages/tox/__init__.py (pid 926767)
	--
	self.fail(str(exc))
	E   AssertionError: HTTPSConnectionPool(host='localhost', port=57705): Max
	retries exceeded with url: /forwarder/test/ (Caused by SSLError(SSLError(1, '[SSL:
	TLSV13_ALERT_CERTIFICATE_REQUIRED] tlsv13 alert certificate required (_ssl.c:2627)')))
	=============================== warnings summary ===============================
	--
	=========================== short test summary info ============================
	FAILED tests/test_custodia.py::CustodiaHTTPSTests::test_client_no_client_cert
	============= 1 failed, 161 passed, 2 warnings in 69.24s (0:01:09) =============
	ERROR: InvocationError for command /usr/src/RPM/BUILD/custodia-0.6.0/.tox/py39/bin/python
	-m coverage run --parallel -m pytest --capture=no --strict (exited with code 1)
	ERROR: invocation failed (exit code 1)
	✖ FAIL py39 in 1 minute, 18.907 seconds
	___________________________________ summary ____________________________________
	ERROR:	 py39: parallel child exit code 1

handbrake-1.3.1-alt3
	MI2a:	mark libnuma
	E: Couldn't find package libvpx5-devel
	hsh-install: Failed to calculate package file list.

libexplain-1.4-alt2
	libtool-default: compile:  x86_64-alt-linux-gcc -pipe -frecord-gcc-switches -Wall -g
	-O2 -Wall -Wextra -Wl,--as-needed -I. -c libexplain/iocontrol/tcgetx.c	-fPIC -DPIC
	-o libexplain/iocontrol/.libs/tcgetx.o
	libexplain/iocontrol/tcgetx.c:47:12: error: invalid application of 'sizeof' to incomplete
	type 'struct termiox'
	47 |	 sizeof(struct termiox), /* data_size */

ocaml-ounit-2.2.4-alt2
	....................................S.............F....
	Error: OUnit:7:Runner:3:Processes#1.
	File
	"/usr/src/RPM/BUILD/ocaml-ounit-2.2.4/_build/default/test/oUnit-OUnit-localhost.localdomain#03.log",
	line 62, characters 1-1:
	Error: OUnit:7:Runner:3:Processes#1 (in the log).
	Raised at OUnitAssert.assert_failure in file "src/lib/ounit2/advanced/oUnitAssert.ml",
	line 45, characters 2-27
	--
	Ran: 55 tests in: 1.24 seconds.
	FAILED: Cases: 55 Tried: 55 Errors: 0 Failures: 1 Skip:  1 Todo: 0 Timeouts: 0.

python3-module-pyga-2.5.0-alt2
	sphinx-build-3 -b pickle -d _build/doctrees   . _build/pickle
	make: sphinx-build-3: No such file or directory
	make: *** [Makefile:57: pickle] Error 127

python3-module-virtualenv-20.1.0-alt1
	SKIPPED [1] tests/unit/activation/conftest.py:249: Fish(
	version=FileNotFoundError(2, 'No such file or directory'),
	creator=CPython3Posix(dest=/usr/src/tmp/pytest-of-builder/pytest-0/popen-gw2/activation-tester-env0/e-$
	èрт🚒♞中片-j, clear=False, global=False),
	interpreter=PythonInfo(spec=CPython3.9.4.final.0-64, system=/usr/bin/python3.9,
	exe=/usr/src/RPM/BUILD/python3-module-virtualenv-20.1.0/.tox/py3/bin/python,
	platform=linux, version='3.9.4 (default, Apr  5 2021, 07:30:23) \n[GCC 10.2.1 20210313
	(ALT Sisyphus 10.2.1-alt3)]', encoding_fs_io=utf-8-utf-8)) is not available due [Errno 2]
	No such file or directory: 'fish'
	SKIPPED [1] tests/unit/test_util.py:19: subprocess patch only applied on Windows python2
	SKIPPED [1] tests/unit/activation/conftest.py:249: Fish(
	version=FileNotFoundError(2, 'No such file or directory'),
	creator=CPython3Posix(dest=/usr/src/tmp/pytest-of-builder/pytest-0/popen-gw3/activation-tester-env0/e-$
	èрт🚒♞中片-j, clear=False, global=False),
	interpreter=PythonInfo(spec=CPython3.9.4.final.0-64, system=/usr/bin/python3.9,
	exe=/usr/src/RPM/BUILD/python3-module-virtualenv-20.1.0/.tox/py3/bin/python,
	platform=linux, version='3.9.4 (default, Apr  5 2021, 07:30:23) \n[GCC 10.2.1 20210313
	(ALT Sisyphus 10.2.1-alt3)]', encoding_fs_io=utf-8-utf-8)) is not available due [Errno 2]
	No such file or directory: 'fish'
	SKIPPED [1] tests/unit/activation/conftest.py:249: Csh(
	version=FileNotFoundError(2, 'No such file or directory'),
	creator=CPython3Posix(dest=/usr/src/tmp/pytest-of-builder/pytest-0/popen-gw2/activation-tester-env1/e-$
	èрт🚒♞中片-j, clear=False, global=False),
	interpreter=PythonInfo(spec=CPython3.9.4.final.0-64, system=/usr/bin/python3.9,
	exe=/usr/src/RPM/BUILD/python3-module-virtualenv-20.1.0/.tox/py3/bin/python,
	platform=linux, version='3.9.4 (default, Apr  5 2021, 07:30:23) \n[GCC 10.2.1 20210313
	(ALT Sisyphus 10.2.1-alt3)]', encoding_fs_io=utf-8-utf-8)) is not available due [Errno 2]
	No such file or directory: 'csh'
	SKIPPED [2] tests/conftest.py:344: could not find 2
	--
	SKIPPED [1] tests/unit/activation/conftest.py:249: Csh(
	version=FileNotFoundError(2, 'No such file or directory'),
	creator=CPython3Posix(dest=/usr/src/tmp/pytest-of-builder/pytest-0/popen-gw4/activation-tester-env1/e-$
	èрт🚒♞中片-j, clear=False, global=False),
	interpreter=PythonInfo(spec=CPython3.9.4.final.0-64, system=/usr/bin/python3.9,
	exe=/usr/src/RPM/BUILD/python3-module-virtualenv-20.1.0/.tox/py3/bin/python,
	platform=linux, version='3.9.4 (default, Apr  5 2021, 07:30:23) \n[GCC 10.2.1 20210313
	(ALT Sisyphus 10.2.1-alt3)]', encoding_fs_io=utf-8-utf-8)) is not available due [Errno 2]
	No such file or directory: 'csh'
	SKIPPED [1] tests/unit/activation/conftest.py:249: PowerShell(
	version=FileNotFoundError(2, 'No such file or directory'),
	creator=CPython3Posix(dest=/usr/src/tmp/pytest-of-builder/pytest-0/popen-gw3/activation-tester-env1/e-$
	èрт🚒♞中片-j, clear=False, global=False),
	interpreter=PythonInfo(spec=CPython3.9.4.final.0-64, system=/usr/bin/python3.9,
	exe=/usr/src/RPM/BUILD/python3-module-virtualenv-20.1.0/.tox/py3/bin/python,
	platform=linux, version='3.9.4 (default, Apr  5 2021, 07:30:23) \n[GCC 10.2.1 20210313
	(ALT Sisyphus 10.2.1-alt3)]', encoding_fs_io=utf-8-utf-8)) is not available due [Errno 2]
	No such file or directory: 'pwsh'
	SKIPPED [1] tests/unit/activation/conftest.py:249: PowerShell(

racket-7.3-alt2
	raco setup: 4 re-rendering: <pkgs>/racket-index/scribblings/main/release.scrbl
	raco setup: 3 re-rendering: <pkgs>/scribble-doc/scribblings/scribble/scribble.scrbl
	raco setup: 2 re-rendering: <pkgs>/racket-index/scribblings/main/start.scrbl
	raco setup: 1 re-rendering:
	<pkgs>/typed-racket-doc/typed-racket/scribblings/ts-reference.scrbl
	raco setup: 0 re-rendering: <pkgs>/racket-index/scribblings/main/local-redirect.scrbl
	raco setup: 4 re-rendering: <pkgs>/racket-index/scribblings/main/search.scrbl
	make[1]: *** [Makefile:196: install-3m] CPU time limit exceeded
	make[1]: Leaving directory '/usr/src/RPM/BUILD/racket-7.3/src'
	make: *** [Makefile:119: install] Error 2
	make: Leaving directory '/usr/src/RPM/BUILD/racket-7.3/src'

seamonkey-1:2.53.7.1-alt1
	Selecting llvm-common-lld-devel for 'lld-devel'
	E: Couldn't find package libvpx5-devel
	hsh-install: Failed to calculate package file list.

	12 error logs REMOVED from the list
SPICE-0.15.0-alt1
bcc-0.18.0-alt2
dopewars-1.5.12-alt2_20.1033svn
glade-3.38.2-alt1
glances-2.11.1-alt2
linux-tools-5.11-alt1
python3-module-iniparse-0.5-alt1
python3-module-sphinxcontrib-programoutput-0.16-alt1
python3-module-sqlalchemy_mptt-0.2.5-alt1
python3-module-wx-4.0.7-alt1
rawstudio-2.1-alt0.5
ufraw-0.23-alt0.2

Total 45 error logs.


Sisyphus-cybertalk