[cyber] I: Sisyphus-20210417 i586 beehive_status: +5 -24 (123)

ALT beekeeper hiver altlinux.org
17 18:33:13 MSK 2021


	5 NEW error logs

deepin-qt5integration-5.1.11-alt1
	ld: cannot find -lchameleon
	collect2: error: ld returned 1 exit status
	make[1]: *** [Makefile:193: tests] Error 1

erlang-triq-1.3.0-alt1
	DEBUG: No processes to kill
	ERROR: One or more eunit tests failed.
	ERROR: eunit failed while processing /usr/src/RPM/BUILD/erlang-triq-1.3.0: rebar_abort

perl-Net-SIP-0.828-alt1
	t/23_valid_message.t .................... ok
	#   Failed test 'DTMF audio generator and extractor for codec pcmu works'
	#   at t/24_dtmf_audio.t line 24.
	--
	#     $expected->[3] = '3'
	#   Failed test 'DTMF audio generator and extractor for codec pcma works'
	#   at t/24_dtmf_audio.t line 24.
	--
	t/24_dtmf_audio.t		      (Wstat: 512 Tests: 2 Failed: 2)
	Failed tests:  1-2
	Non-zero exit status: 2
	--
	Result: FAIL
	Failed 1/22 test programs. 2/1865 subtests failed.
	make: *** [Makefile:828: test_dynamic] Error 2

python3-3.9.4-alt1
	1 test failed:
	test_signal
	22 tests skipped:
	test_curses test_devpoll test_gdb test_ioctl test_kqueue
	test_msilib test_nis test_ossaudiodev test_smtpnet
	test_socketserver test_startfile test_timeout test_tix test_tk
	test_ttk_guionly test_urllib2net test_urllibnet test_winconsoleio
	test_winreg test_winsound test_xmlrpc_net test_zipfile64
	Total duration: 9 min 13 sec
	Tests result: FAILURE

python3-module-virtualenv-20.1.0-alt1
	SKIPPED [1] tests/unit/activation/conftest.py:249: Fish(
	version=FileNotFoundError(2, 'No such file or directory'),
	creator=CPython3Posix(dest=/usr/src/tmp/pytest-of-builder/pytest-0/popen-gw1/activation-tester-env1/e-$
	èрт🚒♞中片-j, clear=False, global=False),
	interpreter=PythonInfo(spec=CPython3.9.4.final.0-32, system=/usr/bin/python3.9,
	exe=/usr/src/RPM/BUILD/python3-module-virtualenv-20.1.0/.tox/py3/bin/python,
	platform=linux, version='3.9.4 (default, Apr  5 2021, 07:30:23) \n[GCC 10.2.1 20210313
	(ALT Sisyphus 10.2.1-alt3)]', encoding_fs_io=utf-8-utf-8)) is not available due [Errno 2]
	No such file or directory: 'fish'
	SKIPPED [1] tests/unit/activation/conftest.py:249: Csh(
	version=FileNotFoundError(2, 'No such file or directory'),
	creator=CPython3Posix(dest=/usr/src/tmp/pytest-of-builder/pytest-0/popen-gw5/activation-tester-env0/e-$
	èрт🚒♞中片-j, clear=False, global=False),
	interpreter=PythonInfo(spec=CPython3.9.4.final.0-32, system=/usr/bin/python3.9,
	exe=/usr/src/RPM/BUILD/python3-module-virtualenv-20.1.0/.tox/py3/bin/python,
	platform=linux, version='3.9.4 (default, Apr  5 2021, 07:30:23) \n[GCC 10.2.1 20210313
	(ALT Sisyphus 10.2.1-alt3)]', encoding_fs_io=utf-8-utf-8)) is not available due [Errno 2]
	No such file or directory: 'csh'
	SKIPPED [2] tests/conftest.py:344: could not find 2
	SKIPPED [1] tests/unit/activation/conftest.py:249: Fish(
	version=FileNotFoundError(2, 'No such file or directory'),
	creator=CPython3Posix(dest=/usr/src/tmp/pytest-of-builder/pytest-0/popen-gw4/activation-tester-env0/e-$
	èрт🚒♞中片-j, clear=False, global=False),
	interpreter=PythonInfo(spec=CPython3.9.4.final.0-32, system=/usr/bin/python3.9,
	exe=/usr/src/RPM/BUILD/python3-module-virtualenv-20.1.0/.tox/py3/bin/python,
	platform=linux, version='3.9.4 (default, Apr  5 2021, 07:30:23) \n[GCC 10.2.1 20210313
	(ALT Sisyphus 10.2.1-alt3)]', encoding_fs_io=utf-8-utf-8)) is not available due [Errno 2]
	No such file or directory: 'fish'
	SKIPPED [2] tests/unit/create/test_creator.py:454: we rewrite sys.path only on PY2
	--
	SKIPPED [1] tests/unit/activation/conftest.py:249: Csh(
	version=FileNotFoundError(2, 'No such file or directory'),
	creator=CPython3Posix(dest=/usr/src/tmp/pytest-of-builder/pytest-0/popen-gw0/activation-tester-env0/e-$
	èрт🚒♞中片-j, clear=False, global=False),
	interpreter=PythonInfo(spec=CPython3.9.4.final.0-32, system=/usr/bin/python3.9,
	exe=/usr/src/RPM/BUILD/python3-module-virtualenv-20.1.0/.tox/py3/bin/python,
	platform=linux, version='3.9.4 (default, Apr  5 2021, 07:30:23) \n[GCC 10.2.1 20210313
	(ALT Sisyphus 10.2.1-alt3)]', encoding_fs_io=utf-8-utf-8)) is not available due [Errno 2]
	No such file or directory: 'csh'
	SKIPPED [2] tests/unit/activation/conftest.py:246: BatchActivator not supported
	--
	SKIPPED [1] tests/unit/activation/conftest.py:249: PowerShell(
	version=FileNotFoundError(2, 'No such file or directory'),
	creator=CPython3Posix(dest=/usr/src/tmp/pytest-of-builder/pytest-0/popen-gw5/activation-tester-env0/e-$
	èрт🚒♞中片-j, clear=False, global=False),
	interpreter=PythonInfo(spec=CPython3.9.4.final.0-32, system=/usr/bin/python3.9,
	exe=/usr/src/RPM/BUILD/python3-module-virtualenv-20.1.0/.tox/py3/bin/python,
	platform=linux, version='3.9.4 (default, Apr  5 2021, 07:30:23) \n[GCC 10.2.1 20210313
	(ALT Sisyphus 10.2.1-alt3)]', encoding_fs_io=utf-8-utf-8)) is not available due [Errno 2]
	No such file or directory: 'pwsh'
	SKIPPED [1] tests/unit/activation/conftest.py:249: PowerShell(

	24 error logs REMOVED from the list
blas-3.9.2-alt2
custodia-0.6.0-alt6
elinks-0.12-alt0.12.7
gcc4.3-4.3.2-alt22
glibc-6:2.32-alt2
guile22-2.2.7-alt1
guile30-3.0.5-alt1
hp2xx-3.4.2-alt1
libxsettings-client0-0.17-alt2
mockito-0:2.23.9-alt1_6jpp8
notmuch-0.28.4-alt1
ocaml-ounit-2.2.4-alt2
opendx-4.4.4-alt8
perl-MouseX-Getopt-0.38-alt1_5
ppsspp-1.11.3-alt1
python-module-future-0.16.0-alt2
python-module-requests-mock-1.3.0-alt1.1
smstools-3.1.21-alt1
transgui-5.18.0-alt3
unnethack-5.2.0-alt3
util-linux-2.36.1-alt2
wraplinux-1.7-alt1
xdg-desktop-portal-1.8.1-alt1
xiphos-4.2.1-alt1

Total 123 error logs.


Sisyphus-cybertalk