[cyber] I: Sisyphus-20210412 x86_64 beehive_status: +7 -62 (164)

ALT beekeeper hiver altlinux.org
12 09:49:28 MSK 2021


	7 NEW error logs

apache2-mod_nss-1.0.18-alt2
	if expected_str not in str(e):
	TypeError: 'in <string>' requires string as left operand, not NoneType
	-------------------- >> begin captured logging << --------------------
	--
	--------------------- >> end captured logging << ---------------------
	ERROR: test_suite1[9]: /acl/aclS02.html: NSSRequire auth, valid certificate
	Traceback (most recent call last):
	--
	--------------------- >> end captured logging << ---------------------
	ERROR: test_suite1[12]: /acl/aclS03.html: FakeBasicAuth, valid certificate
	Traceback (most recent call last):
	--
	--------------------- >> end captured logging << ---------------------
	ERROR: test_suite1[15]: /secret-test.html: Secret key size
	Traceback (most recent call last):
	--
	--------------------- >> end captured logging << ---------------------
	ERROR: test_suite1[18]: /protocolssl3/index.html: Try SSLv23 client on SSLv3 location
	Traceback (most recent call last):
	--
	--------------------- >> end captured logging << ---------------------
	ERROR: test_suite1[21]: /protocoltls12/index.html: Try SSLv23 client on 1.2-only location
	Traceback (most recent call last):
	--
	--------------------- >> end captured logging << ---------------------
	ERROR: test_suite1[24]: /dhe_cipher/: server-side DHE cipher check
	Traceback (most recent call last):
	--
	Ran 25 tests in 332.267s
	FAILED (errors=9)
	make: *** [Makefile:1160: check] Error 1

clisp-1:2.49.92-alt2
	Bye.
	(echo *.erg | grep '*' >/dev/null) || (echo "Test failed:" ; ls -l *erg; echo "To see
	which tests failed, type" ; echo "    cat "`pwd`"/*.erg" ; exit 1)
	Test failed:
	-rw-r--r-- 1 builder builder 848 Apr 12 05:21 socket.erg
	To see which tests failed, type
	cat /usr/src/RPM/BUILD/clisp-2.49.92/src/tests/*.erg

curl-7.76.0-alt1
	TESTDONE: 1123 tests out of 1124 reported OK: 99%
	TESTFAIL: These test cases failed: 644
	make[1]: *** [Makefile:805: full-test] Error 1

glibc-6:2.32-alt2
	UNSUPPORTED: sunrpc/tst-svc_register
	FAIL: time/tst-cpuclock1
	Summary of test results:
	--
	+ rc=2
	+ grep '^FAIL:' build-x86_64-linux/tests.sum
	+ cut '-d ' -f2-
	--
	==> build-x86_64-linux/time/tst-cpuclock1.test-result <==
	FAIL: time/tst-cpuclock1
	original exit status 1

python3-module-pexpect-4.8.0-alt1
	+ command)
	E	    ValueError: Continuation prompt found - input was incomplete:
	E	    echo $HOME
	--
	=========================== short test summary info ============================
	FAILED tests/test_interact.py::InteractTestCase::test_interact_escape_None - ...
	FAILED tests/test_interact.py::InteractTestCase::test_interact_exit_unicode
	FAILED tests/test_replwrap.py::REPLWrapTestCase::test_existing_spawn - ValueE...
	============ 3 failed, 231 passed, 13 warnings in 175.38s (0:02:55) ============

python3-module-virtualenv-20.1.0-alt1
	SKIPPED [1] tests/unit/activation/conftest.py:249: Fish(
	version=FileNotFoundError(2, 'No such file or directory'),
	creator=CPython3Posix(dest=/usr/src/tmp/pytest-of-builder/pytest-0/popen-gw0/activation-tester-env0/e-$
	èрт🚒♞中片-j, clear=False, global=False),
	interpreter=PythonInfo(spec=CPython3.9.4.final.0-64, system=/usr/bin/python3.9,
	exe=/usr/src/RPM/BUILD/python3-module-virtualenv-20.1.0/.tox/py3/bin/python,
	platform=linux, version='3.9.4 (default, Apr  5 2021, 07:30:23) \n[GCC 10.2.1 20210313
	(ALT Sisyphus 10.2.1-alt3)]', encoding_fs_io=utf-8-utf-8)) is not available due [Errno 2]
	No such file or directory: 'fish'
	SKIPPED [1] tests/unit/activation/conftest.py:249: Fish(
	version=FileNotFoundError(2, 'No such file or directory'),
	creator=CPython3Posix(dest=/usr/src/tmp/pytest-of-builder/pytest-0/popen-gw2/activation-tester-env1/e-$
	èрт🚒♞中片-j, clear=False, global=False),
	interpreter=PythonInfo(spec=CPython3.9.4.final.0-64, system=/usr/bin/python3.9,
	exe=/usr/src/RPM/BUILD/python3-module-virtualenv-20.1.0/.tox/py3/bin/python,
	platform=linux, version='3.9.4 (default, Apr  5 2021, 07:30:23) \n[GCC 10.2.1 20210313
	(ALT Sisyphus 10.2.1-alt3)]', encoding_fs_io=utf-8-utf-8)) is not available due [Errno 2]
	No such file or directory: 'fish'
	SKIPPED [2] tests/unit/activation/conftest.py:246: BatchActivator not supported
	--
	SKIPPED [1] tests/unit/activation/conftest.py:249: Csh(
	version=FileNotFoundError(2, 'No such file or directory'),
	creator=CPython3Posix(dest=/usr/src/tmp/pytest-of-builder/pytest-0/popen-gw0/activation-tester-env1/e-$
	èрт🚒♞中片-j, clear=False, global=False),
	interpreter=PythonInfo(spec=CPython3.9.4.final.0-64, system=/usr/bin/python3.9,
	exe=/usr/src/RPM/BUILD/python3-module-virtualenv-20.1.0/.tox/py3/bin/python,
	platform=linux, version='3.9.4 (default, Apr  5 2021, 07:30:23) \n[GCC 10.2.1 20210313
	(ALT Sisyphus 10.2.1-alt3)]', encoding_fs_io=utf-8-utf-8)) is not available due [Errno 2]
	No such file or directory: 'csh'
	SKIPPED [1] tests/unit/create/test_creator.py:281: python 2 only tests
	--
	SKIPPED [1] tests/unit/activation/conftest.py:249: Csh(
	version=FileNotFoundError(2, 'No such file or directory'),
	creator=CPython3Posix(dest=/usr/src/tmp/pytest-of-builder/pytest-0/popen-gw1/activation-tester-env0/e-$
	èрт🚒♞中片-j, clear=False, global=False),
	interpreter=PythonInfo(spec=CPython3.9.4.final.0-64, system=/usr/bin/python3.9,
	exe=/usr/src/RPM/BUILD/python3-module-virtualenv-20.1.0/.tox/py3/bin/python,
	platform=linux, version='3.9.4 (default, Apr  5 2021, 07:30:23) \n[GCC 10.2.1 20210313
	(ALT Sisyphus 10.2.1-alt3)]', encoding_fs_io=utf-8-utf-8)) is not available due [Errno 2]
	No such file or directory: 'csh'
	SKIPPED [1] tests/unit/activation/conftest.py:249: PowerShell(
	version=FileNotFoundError(2, 'No such file or directory'),
	creator=CPython3Posix(dest=/usr/src/tmp/pytest-of-builder/pytest-0/popen-gw3/activation-tester-env0/e-$
	èрт🚒♞中片-j, clear=False, global=False),
	interpreter=PythonInfo(spec=CPython3.9.4.final.0-64, system=/usr/bin/python3.9,
	exe=/usr/src/RPM/BUILD/python3-module-virtualenv-20.1.0/.tox/py3/bin/python,
	platform=linux, version='3.9.4 (default, Apr  5 2021, 07:30:23) \n[GCC 10.2.1 20210313
	(ALT Sisyphus 10.2.1-alt3)]', encoding_fs_io=utf-8-utf-8)) is not available due [Errno 2]
	No such file or directory: 'pwsh'
	SKIPPED [2] tests/conftest.py:344: could not find 2

springrts-104.0-alt3
	[ 33%] Linking CXX static library libengineSim.a
	cd /usr/src/RPM/BUILD/springrts-104.0/BUILD/rts/Sim && /usr/bin/cmake -P
	CMakeFiles/engineSim.dir/cmake_clean_target.cmake
	cd /usr/src/RPM/BUILD/springrts-104.0/BUILD/rts/Sim && /usr/bin/cmake -E cmake_link_script
	CMakeFiles/engineSim.dir/link.txt --verbose=1
	/usr/bin/ar qc libengineSim.a CMakeFiles/engineSim.dir/Features/Feature.cpp.o
	CMakeFiles/engineSim.dir/Features/FeatureDef.cpp.o
	CMakeFiles/engineSim.dir/Features/FeatureDefHandler.cpp.o
	CMakeFiles/engineSim.dir/Features/FeatureHandler.cpp.o
	CMakeFiles/engineSim.dir/Misc/AllyTeam.cpp.o
	CMakeFiles/engineSim.dir/Misc/BuildingMaskMap.cpp.o
	CMakeFiles/engineSim.dir/Misc/CategoryHandler.cpp.o
	CMakeFiles/engineSim.dir/Misc/CollisionHandler.cpp.o
	CMakeFiles/engineSim.dir/Misc/CollisionVolume.cpp.o
	CMakeFiles/engineSim.dir/Misc/CommonDefHandler.cpp.o
	CMakeFiles/engineSim.dir/Misc/DamageArray.cpp.o
	CMakeFiles/engineSim.dir/Misc/DamageArrayHandler.cpp.o
	CMakeFiles/engineSim.dir/Misc/DefinitionTag.cpp.o
	CMakeFiles/engineSim.dir/Misc/GeometricObjects.cpp.o
	CMakeFiles/engineSim.dir/Misc/GlobalSynced.cpp.o
	CMakeFiles/engineSim.dir/Misc/GroundBlockingObjectMap.cpp.o
	CMakeFiles/engineSim.dir/Misc/InterceptHandler.cpp.o
	CMakeFiles/engineSim.dir/Misc/LosHandler.cpp.o CMakeFiles/engineSim.dir/Misc/LosMap.cpp.o
	CMakeFiles/engineSim.dir/Misc/ModInfo.cpp.o
	CMakeFiles/engineSim.dir/Misc/NanoPieceCache.cpp.o
	CMakeFiles/engineSim.dir/Misc/QuadField.cpp.o CMakeFiles/engineSim.dir/Misc/Resource.cpp.o
	CMakeFiles/engineSim.dir/Misc/ResourceHandler.cpp.o
	CMakeFiles/engineSim.dir/Misc/ResourceMapAnalyzer.cpp.o
	CMakeFiles/engineSim.dir/Misc/SideParser.cpp.o
	CMakeFiles/engineSim.dir/Misc/SimObjectIDPool.cpp.o
	CMakeFiles/engineSim.dir/Misc/SmoothHeightMesh.cpp.o
	CMakeFiles/engineSim.dir/Misc/Team.cpp.o CMakeFiles/engineSim.dir/Misc/TeamBase.cpp.o
	CMakeFiles/engineSim.dir/Misc/TeamHandler.cpp.o
	CMakeFiles/engineSim.dir/Misc/TeamStatistics.cpp.o CMakeFiles/engineSim.dir/Misc/Wind.cpp.o
	CMakeFiles/engineSim.dir/MoveTypes/AAirMoveType.cpp.o
	CMakeFiles/engineSim.dir/MoveTypes/StrafeAirMoveType.cpp.o
	CMakeFiles/engineSim.dir/MoveTypes/GroundMoveType.cpp.o
	CMakeFiles/engineSim.dir/MoveTypes/MoveDefHandler.cpp.o
	CMakeFiles/engineSim.dir/MoveTypes/MoveMath/GroundMoveMath.cpp.o
	CMakeFiles/engineSim.dir/MoveTypes/MoveMath/HoverMoveMath.cpp.o
	CMakeFiles/engineSim.dir/MoveTypes/MoveMath/MoveMath.cpp.o
	CMakeFiles/engineSim.dir/MoveTypes/MoveMath/ShipMoveMath.cpp.o
	CMakeFiles/engineSim.dir/MoveTypes/MoveType.cpp.o
	CMakeFiles/engineSim.dir/MoveTypes/MoveTypeFactory.cpp.o
	CMakeFiles/engineSim.dir/MoveTypes/ScriptMoveType.cpp.o
	CMakeFiles/engineSim.dir/MoveTypes/StaticMoveType.cpp.o
	CMakeFiles/engineSim.dir/MoveTypes/HoverAirMoveType.cpp.o
	CMakeFiles/engineSim.dir/Objects/SolidObject.cpp.o
	CMakeFiles/engineSim.dir/Objects/SolidObjectDef.cpp.o
	CMakeFiles/engineSim.dir/Objects/WorldObject.cpp.o
	CMakeFiles/engineSim.dir/Path/Default/IPathFinder.cpp.o
	CMakeFiles/engineSim.dir/Path/Default/PathCache.cpp.o
	CMakeFiles/engineSim.dir/Path/Default/PathEstimator.cpp.o
	CMakeFiles/engineSim.dir/Path/Default/PathFinder.cpp.o
	CMakeFiles/engineSim.dir/Path/Default/PathFinderDef.cpp.o
	CMakeFiles/engineSim.dir/Path/Default/PathFlowMap.cpp.o
	CMakeFiles/engineSim.dir/Path/Default/PathHeatMap.cpp.o
	CMakeFiles/engineSim.dir/Path/Default/PathManager.cpp.o
	CMakeFiles/engineSim.dir/Path/QTPFS/Node.cpp.o
	CMakeFiles/engineSim.dir/Path/QTPFS/NodeLayer.cpp.o
	CMakeFiles/engineSim.dir/Path/QTPFS/PathCache.cpp.o
	CMakeFiles/engineSim.dir/Path/QTPFS/PathSearch.cpp.o
	CMakeFiles/engineSim.dir/Path/QTPFS/PathManager.cpp.o
	CMakeFiles/engineSim.dir/Path/IPathController.cpp.o
	CMakeFiles/engineSim.dir/Path/IPathManager.cpp.o
	CMakeFiles/engineSim.dir/Projectiles/ExpGenSpawnable.cpp.o
	CMakeFiles/engineSim.dir/Projectiles/ExpGenSpawner.cpp.o
	CMakeFiles/engineSim.dir/Projectiles/ExplosionListener.cpp.o
	CMakeFiles/engineSim.dir/Projectiles/ExplosionGenerator.cpp.o
	CMakeFiles/engineSim.dir/Projectiles/FireProjectile.cpp.o
	CMakeFiles/engineSim.dir/Projectiles/FlareProjectile.cpp.o
	CMakeFiles/engineSim.dir/Projectiles/PieceProjectile.cpp.o
	CMakeFiles/engineSim.dir/Projectiles/Projectile.cpp.o
	CMakeFiles/engineSim.dir/Projectiles/ProjectileHandler.cpp.o
	CMakeFiles/engineSim.dir/Projectiles/ProjectileFunctors.cpp.o
	CMakeFiles/engineSim.dir/Projectiles/WeaponProjectiles/BeamLaserProjectile.cpp.o
	CMakeFiles/engineSim.dir/Pr
	/usr/bin/ranlib libengineSim.a
	make[2]: Leaving directory '/usr/src/RPM/BUILD/springrts-104.0/BUILD'
	make[1]: Entering directory '/usr/src/RPM/BUILD/springrts-104.0/BUILD'
	[ 33%] Built target engineSim
	make[1]: Leaving directory '/usr/src/RPM/BUILD/springrts-104.0/BUILD'
	make: *** [Makefile:160: all] Error 2

	62 error logs REMOVED from the list
automake_1.11-1.11.6-alt9
chromium-89.0.4389.114-alt1
custodia-0.6.0-alt6
daskr-2011.06.08-alt1
fuse-zfs-0.7.2.2-alt1_14
gkrellm-gtodo-0.2.4-alt1
gpaste-3.38.6-alt1
hardinfo-0.6-alt0.1.alpha.gitb2991d7
hnb-1.9.18-alt1.qa1
hping2-2.0.0-alt4.rc2.qa3
ht-2.1.0-alt2
icukrell-2.0.0-alt2_pre0.1.qa1
ipband-0.8.1-alt1
ipv6calc-0.94.1-alt1
kernel-image-rt-4.19.180-alt1.rt73
launchtool-0.7-alt1.qa1
lazy-0.24d-alt2.qa1
libdlna-0.2.4-alt2_12
libgupnp-igd-1.2.0-alt1.1
libkarma-0.1.2-alt1_12
libmonetra-7.14.0-alt1_1.1
libopennet-0.9.9-alt1_10
libslatec-4.1-alt7
linuxtv-dvb-apps-1.1.1-alt2.2
lush-2.0.1-alt3
lzmalib-0.0.1-alt1_10
memmapper-1.42-alt1.qa1
mjpegtools-2.1.0-alt3
motion-4.1.1-alt3
multipath-tools-0.8.3-alt2
musl-1.1.3-alt2
netwalk-0.4.10-alt6
ogdi-3.2.0-alt1.beta2.2
open-iscsi-2.0.877-alt1.git73652184
openal-1.19.1-alt1
openrrcp-0.2.1-alt1
openscap-1.3.0-alt1
opentracker-1.6-alt2
os-autoinst-4.6-alt1
p3nfs-5.19-alt1.qa2
pidgin-plugin-mrim-0.1.28-alt3
procinfo-1:18-alt1.qa1
proxychains-3.1-alt2
pvm-3.4.6-alt1.1.qa1
qtiplot-0.9.8.9-alt9.svn20120124
restbed-4.0-alt1_7
roxterm-3.1.4-alt4
scmpc-0.4.1-alt1.git20130304
sdlscav-145.1_2010_11_5-alt1
sjog-cvs20040812-alt4.1
skippy-0.5.0-alt2.qa1
squidGuard-1.4-alt1.qa1
squidclam-0.23-alt1
sven-0.6-alt3
thinkfan-0.9.1-alt1
transgui-5.18.0-alt3
util-linux-2.36.1-alt2
xd3d-8.3.1-alt5
xmedcon-0.16.2-alt1
xygrib-1.2.6-alt2
zabbix-module-sockets-1.1.0-alt4
zabbix-module-systemd-1.0.0-alt4

Total 164 error logs.


Sisyphus-cybertalk