[cyber] I: Sisyphus-20210405 i586 beehive_status: +14 -24 (297)

ALT beekeeper hiver altlinux.org
5 16:44:24 MSK 2021


	14 NEW error logs

SNNS-4.3-alt1.1.1.1
	ar  rc	lib3d.a net_analyzer.o d3_xUtils.o d3_global.o d3_anageo.o d3_shade.o d3_lists.o
	d3_point.o d3_dither.o d3_zgraph.o d3_fonts.o d3_graph.o d3_draw.o d3_disp.o d3_move.o
	d3_zValue.o d3_setup.o d3_units.o d3_links.o d3_model.o d3_project.o d3_light.o
	d3_pannels.o d3_main.o bn_bignet.o bn_basics.o bn_art1.o bn_art2.o bn_artmap.o
	bn_TD_bignet.o bn_kohonen.o bn_assoz.o o_graph.o bn_JordElm.o ui_class.o bn_bighop.o
	ranlib	lib3d.a
	make[1]: Leaving directory '/usr/src/RPM/BUILD/SNNSv4.3/xgui/sources'
	make[1]: Entering directory '/usr/src/RPM/BUILD/SNNSv4.3/xgui/sources'
	i586-alt-linux-gcc  libxgui1.a libxgui2.a lib3d.a \
	-lXaw3d -lXmu -lXt -lXext -lSM -lICE  -lX11  \
	../../kernel/sources/libkernel.a ../../kernel/sources/libfunc.a -lm -lfl  -o xgui
	ld: libxgui1.a(ui_controlP.o): in function `ui_rem_performPrunInit':
	/usr/src/RPM/BUILD/SNNSv4.3/xgui/sources/ui_controlP.c:1191: warning: the use of
	`tempnam' is dangerous, better use `mkstemp'
	make[1]: Leaving directory '/usr/src/RPM/BUILD/SNNSv4.3/xgui/sources'

emacs-misc-modes-0.2-alt10.3
	Selected version emacs-devel#0.0.2-alt1  1256384841 for emacs-devel>=0.0.1-alt2
	E: Couldn't find package emacs-bbdb
	hsh-install: Failed to calculate package file list.

ghc8.6.4-sha-1.6.4.4-alt1
	unrecognised command: makefile (try --help)
	+ ./Setup build
	Preprocessing library for SHA-1.6.4.4..
	Building library for SHA-1.6.4.4..
	[1 of 1] Compiling Data.Digest.Pure.SHA ( src/Data/Digest/Pure/SHA.hs,
	dist/build/Data/Digest/Pure/SHA.o )
	[1 of 1] Compiling Data.Digest.Pure.SHA ( src/Data/Digest/Pure/SHA.hs,
	dist/build/Data/Digest/Pure/SHA.p_o )
	ghc: out of memory (requested 1048576 bytes)
	error: Bad exit status from /usr/src/tmp/rpm-tmp.42423 (%build)
	RPM build errors:
	File /usr/src/RPM/SOURCES/ghc8.6.4-sha-1.6.4.4-alt1.patch is smaller than 8 bytes

glibc-6:2.32-alt2
	UNSUPPORTED: sunrpc/tst-svc_register
	FAIL: time/tst-cpuclock1
	UNSUPPORTED: time/tst-y2039
	--
	+ rc=2
	+ grep '^FAIL:' build-i586-linux/tests.sum
	+ xargs -i tail -v -n 100 'build-i586-linux/{}.test-result' 'build-i586-linux/{}.out'
	--
	==> build-i586-linux/time/tst-cpuclock1.test-result <==
	FAIL: time/tst-cpuclock1
	original exit status 1

httpcomponents-core-4.4.10-alt1_5jpp8
	[ERROR] -> [Help 1]
	[ERROR]
	[ERROR] To see the full stack trace of the errors, re-run Maven with the -e switch.
	[ERROR] Re-run Maven using the -X switch to enable full debug logging.
	[ERROR]
	[ERROR] For more information about the errors and possible solutions, please read the
	following articles:
	[ERROR] [Help 1] http://cwiki.apache.org/confluence/display/MAVEN/MojoFailureException
	[ERROR]
	[ERROR] After correcting the problems, you can resume the build with the command
	[ERROR]   mvn <goals> -rf :httpcore

lcdproc-0.5.7-alt4
	In file included from hd44780.c:91:
	hd44780-low.h:29:11: fatal error: ftdi.h: No such file or directory
	29 | # include <ftdi.h>
	--
	In file included from hd44780-lis2.c:24:
	hd44780-low.h:29:11: fatal error: ftdi.h: No such file or directory
	29 | # include <ftdi.h>
	--
	In file included from hd44780-usblcd.c:22:
	hd44780-low.h:29:11: fatal error: ftdi.h: No such file or directory
	29 | # include <ftdi.h>
	--
	In file included from hd44780-serial.c:54:
	hd44780-low.h:29:11: fatal error: ftdi.h: No such file or directory
	29 | # include <ftdi.h>

libsigrok-0.5.2-alt1
	In file included from src/hardware/asix-sigma/api.c:23:
	src/hardware/asix-sigma/protocol.h:28:10: fatal error: ftdi.h: No such file or directory
	28 | #include <ftdi.h>
	--
	In file included from src/hardware/asix-sigma/protocol.c:27:
	src/hardware/asix-sigma/protocol.h:28:10: fatal error: ftdi.h: No such file or directory
	28 | #include <ftdi.h>

morphia-1.0.1-alt1_9jpp8
	Selecting glassfish-jaxb-runtime for 'mvn(com.sun.xml.bind:jaxb-impl)'
	E: Couldn't find package mvn(com.thoughtworks.proxytoys:proxytoys)
	hsh-install: Failed to calculate package file list.

openocd-0.11.0-alt2
	In file included from src/jtag/drivers/openjtag.c:85:
	src/jtag/drivers/libftdi_helper.h:6:10: fatal error: ftdi.h: No such file or directory
	6 | #include <ftdi.h>

python3-3.9.2-alt1
	1 test failed:
	test_signal
	22 tests skipped:
	test_curses test_devpoll test_gdb test_ioctl test_kqueue
	test_msilib test_nis test_ossaudiodev test_smtpnet
	test_socketserver test_startfile test_timeout test_tix test_tk
	test_ttk_guionly test_urllib2net test_urllibnet test_winconsoleio
	test_winreg test_winsound test_xmlrpc_net test_zipfile64
	Total duration: 11 min 56 sec
	Tests result: FAILURE

python3-module-virtualenv-20.1.0-alt1
	SKIPPED [1] tests/unit/activation/conftest.py:249: Csh(
	version=FileNotFoundError(2, 'No such file or directory'),
	creator=CPython3Posix(dest=/usr/src/tmp/pytest-of-builder/pytest-0/popen-gw2/activation-tester-env0/e-$
	èрт🚒♞中片-j, clear=False, global=False),
	interpreter=PythonInfo(spec=CPython3.9.2.final.0-32, system=/usr/bin/python3.9,
	exe=/usr/src/RPM/BUILD/python3-module-virtualenv-20.1.0/.tox/py3/bin/python,
	platform=linux, version='3.9.2 (default, Feb 26 2021, 15:33:46) \n[GCC 10.2.1 20201125
	(ALT Sisyphus 10.2.1-alt2)]', encoding_fs_io=utf-8-utf-8)) is not available due [Errno 2]
	No such file or directory: 'csh'
	SKIPPED [1] tests/unit/test_util.py:19: subprocess patch only applied on Windows python2
	SKIPPED [1] tests/unit/activation/conftest.py:249: Fish(
	version=FileNotFoundError(2, 'No such file or directory'),
	creator=CPython3Posix(dest=/usr/src/tmp/pytest-of-builder/pytest-0/popen-gw4/activation-tester-env0/e-$
	èрт🚒♞中片-j, clear=False, global=False),
	interpreter=PythonInfo(spec=CPython3.9.2.final.0-32, system=/usr/bin/python3.9,
	exe=/usr/src/RPM/BUILD/python3-module-virtualenv-20.1.0/.tox/py3/bin/python,
	platform=linux, version='3.9.2 (default, Feb 26 2021, 15:33:46) \n[GCC 10.2.1 20201125
	(ALT Sisyphus 10.2.1-alt2)]', encoding_fs_io=utf-8-utf-8)) is not available due [Errno 2]
	No such file or directory: 'fish'
	SKIPPED [1] tests/unit/discovery/windows/test_windows_pep514.py:33: no Windows registry
	SKIPPED [1] tests/unit/activation/conftest.py:249: Csh(
	version=FileNotFoundError(2, 'No such file or directory'),
	creator=CPython3Posix(dest=/usr/src/tmp/pytest-of-builder/pytest-0/popen-gw3/activation-tester-env1/e-$
	èрт🚒♞中片-j, clear=False, global=False),
	interpreter=PythonInfo(spec=CPython3.9.2.final.0-32, system=/usr/bin/python3.9,
	exe=/usr/src/RPM/BUILD/python3-module-virtualenv-20.1.0/.tox/py3/bin/python,
	platform=linux, version='3.9.2 (default, Feb 26 2021, 15:33:46) \n[GCC 10.2.1 20201125
	(ALT Sisyphus 10.2.1-alt2)]', encoding_fs_io=utf-8-utf-8)) is not available due [Errno 2]
	No such file or directory: 'csh'
	SKIPPED [2] tests/unit/activation/conftest.py:246: BatchActivator not supported
	--
	SKIPPED [1] tests/unit/activation/conftest.py:249: Fish(
	version=FileNotFoundError(2, 'No such file or directory'),
	creator=CPython3Posix(dest=/usr/src/tmp/pytest-of-builder/pytest-0/popen-gw6/activation-tester-env0/e-$
	èрт🚒♞中片-j, clear=False, global=False),
	interpreter=PythonInfo(spec=CPython3.9.2.final.0-32, system=/usr/bin/python3.9,
	exe=/usr/src/RPM/BUILD/python3-module-virtualenv-20.1.0/.tox/py3/bin/python,
	platform=linux, version='3.9.2 (default, Feb 26 2021, 15:33:46) \n[GCC 10.2.1 20201125
	(ALT Sisyphus 10.2.1-alt2)]', encoding_fs_io=utf-8-utf-8)) is not available due [Errno 2]
	No such file or directory: 'fish'
	SKIPPED [2] tests/unit/create/test_creator.py:454: we rewrite sys.path only on PY2
	--
	SKIPPED [1] tests/unit/activation/conftest.py:249: PowerShell(
	version=FileNotFoundError(2, 'No such file or directory'),
	creator=CPython3Posix(dest=/usr/src/tmp/pytest-of-builder/pytest-0/popen-gw1/activation-tester-env0/e-$
	èрт🚒♞中片-j, clear=False, global=False),
	interpreter=PythonInfo(spec=CPython3.9.2.final.0-32, system=/usr/bin/python3.9,
	exe=/usr/src/RPM/BUILD/python3-module-virtualenv-20.1.0/.tox/py3/bin/python,
	platform=linux, version='3.9.2 (default, Feb 26 2021, 15:33:46) \n[GCC 10.2.1 20201125
	(ALT Sisyphus 10.2.1-alt2)]', encoding_fs_io=utf-8-utf-8)) is not available due [Errno 2]
	No such file or directory: 'pwsh'
	SKIPPED [1] tests/unit/activation/conftest.py:249: PowerShell(

qlcplus-5.0.0-alt1.alpha3
	make[3]: Entering directory '/usr/src/RPM/BUILD/qlcplus-5.0.0/plugins/midi/test'
	g++ -c -pipe -Wno-unused-local-typedefs -O2 -Wall -Wextra
	-D_REENTRANT -fPIC -DQT_NO_DEBUG -DQT_TESTLIB_LIB -DQT_CORE_LIB
	-DQT_TESTCASE_BUILDDIR='"/usr/src/RPM/BUILD/qlcplus-5.0.0/plugins/midi/test"'
	-I. -I../../interfaces -I../src/common -I/usr/include/qt5 -I/usr/include/qt5/QtTest
	-I/usr/include/qt5/QtCore -I. -I/usr/lib/qt5/mkspecs/linux-g++ -o qlcioplugin.o
	../../interfaces/qlcioplugin.cpp
	make[3]: Leaving directory '/usr/src/RPM/BUILD/qlcplus-5.0.0/plugins/midi/test'
	make[3]: Entering directory '/usr/src/RPM/BUILD/qlcplus-5.0.0/plugins/midi/test'
	g++ -c -pipe -Wno-unused-local-typedefs -O2 -Wall -Wextra
	-D_REENTRANT -fPIC -DQT_NO_DEBUG -DQT_TESTLIB_LIB -DQT_CORE_LIB
	-DQT_TESTCASE_BUILDDIR='"/usr/src/RPM/BUILD/qlcplus-5.0.0/plugins/midi/test"'
	-I. -I../../interfaces -I../src/common -I/usr/include/qt5 -I/usr/include/qt5/QtTest
	-I/usr/include/qt5/QtCore -I. -I/usr/lib/qt5/mkspecs/linux-g++ -o midiprotocol.o
	../src/common/midiprotocol.cpp
	make[3]: Leaving directory '/usr/src/RPM/BUILD/qlcplus-5.0.0/plugins/midi/test'
	make[3]: Entering directory '/usr/src/RPM/BUILD/qlcplus-5.0.0/plugins/midi/test'
	g++ -Wl,-O1 -o midi_test midi_test.o midiprotocol.o qlcioplugin.o moc_midi_test.o
	moc_qlcioplugin.o   -L../src /usr/lib/libQt5Test.so /usr/lib/libQt5Core.so -lpthread
	make[3]: Leaving directory '/usr/src/RPM/BUILD/qlcplus-5.0.0/plugins/midi/test'
	make: *** [Makefile:356: sub-plugins-make_first-ordered] Error 2

querydsl-4.0.4-alt5_6jpp8
	Selecting mysema-commons-lang for 'mvn(com.mysema.commons:mysema-commons-lang)'
	E: Couldn't find package mvn(com.thoughtworks.proxytoys:proxytoys)
	hsh-install: Failed to calculate package file list.

querydsl3-3.7.2-alt5_9jpp8
	Selecting mysema-commons-lang for 'mvn(com.mysema.commons:mysema-commons-lang)'
	E: Couldn't find package mvn(com.thoughtworks.proxytoys:proxytoys)
	hsh-install: Failed to calculate package file list.

	24 error logs REMOVED from the list
angband-4.1.2-alt1
avro-1.7.6-alt5_5jpp8
custodia-0.6.0-alt6
emacs-bbdb-2.35-alt3
emacs-manual-ru-20.7-alt1.qa1
gravit-0.5.0-alt1.1
gumtree-2.1.1-alt1
libgdchart-0.11.5-alt1.1.qa1
liquidwar-5.6.4-alt6.1
nibbles-0.0.4-alt1.qa2
ocaml-ounit-2.2.4-alt2
pekwm-0.1.17-alt2
phlipple-0.8.5-alt3
proxytoys-0:1.0-alt1_14jpp8
python-module-descartes-1.1.0-alt1.1
python3-module-fake-factory-4.14.0-alt1
python3-module-js.jquery_joyride-1.0.3.1-alt2
python3-module-js.jquery_qtip-1.0.0-alt2
python3-module-lmoments3-1.0.4-alt2
python3-module-pytest-cov-2.10.1-alt2
python3-module-sphinx-argparse-0.2.5-alt1
python3-module-sphinxcontrib-ansi-0.6-alt2
python3-module-sphinxjp.themes.revealjs-0.3.0-alt3
wmclockmon-0.8.1-alt5.qa1

Total 297 error logs.


Sisyphus-cybertalk