[cyber] I: Sisyphus-20200908 x86_64 beehive_status: +14 -18 (158)

ALT beekeeper hiver altlinux.org
8 09:19:11 MSK 2020


	14 NEW error logs

atlas-3.9.35-alt1.qa1
	make[4]: Entering directory '/usr/src/RPM/BUILD/ATLAS/BUILD/tune/b
	hasher-priv: master: idle time limit (3600 seconds) exceeded

chromium-84.0.4147.105-alt1
	[30982/40274] touch obj/media/gpu/command_buffer_helper.stamp
	[30983/40274] touch obj/media/gpu/common.stamp
	[30984/40274] touch obj/media/mojo/common/mojo_shared_buffer_video_frame.stamp
	[30985/40274] rm -f obj/gpu/ipc/libgl_in_process_context.a && "llvm-ar" -T -r -c -s -D
	obj/gpu/ipc/libgl_in_process_context.a @"obj/gpu/ipc/libgl_in_process_context.a.rsp"
	[30986/40274] touch obj/media/base/ipc/ipc.stamp
	[30987/40274] rm -f obj/media/capture/libcapture_base.a && "llvm-ar" -T -r -c -s -D
	obj/media/capture/libcapture_base.a @"obj/media/capture/libcapture_base.a.rsp"
	[30988/40274] touch obj/media/gpu/vaapi/common.stamp
	[30989/40274] touch obj/media/gpu/ipc/common/common.stamp
	[30990/40274] touch obj/media/gpu/chromeos/fourcc.stamp
	hasher-priv: master: time elapsed limit (21000 seconds) exceeded

cpprest-2.10.16-alt1
	[ 18%] Linking CXX shared library ../Binaries/libcpprest.so
	x86_64-alt-linux-g++: error: unrecognized command line option '-R'
	make[2]: *** [src/CMakeFiles/cpprest.dir/build.make:517: Binaries/libcpprest.so.2.10]
	Error 1

doublecmd-1.0.0-alt0.1.rev9483
	$00000000009E99B4
	$00000000009EAC0E
	ontrols
	(1008) 9022 строк скомпилиpовано, 0.9 сек.
	(1021) 3 предупреждений
	(1022) 81 подсказок
	(1023) 52 заметок
	TProject.DoLoadStateFile Statefile not found:
	/usr/src/RPM/BUILD/doublecmd-1.0.0/units/x86_64-linux-qt5/.compiled
	Info: (lazarus) Execute Title="Project: Executing command before"
	Info: (lazarus) Working Directory="/usr/src/RPM/BUILD/doublecmd-1.0.0/src/"

fontforge-20200314-alt2
	[ 58%] Linking CXX shared library ../lib/libfontforge.so
	x86_64-alt-linux-g++: error: unrecognized command line option '-R'
	make[2]: *** [fontforge/CMakeFiles/fontforge.dir/build.make:1648: lib/libfontforge.so.4]
	Error 1

ipmiutil-3.1.3-alt1
	/usr/bin/ld.default: iseltime.o: in function `get_sel_time':
	/usr/src/RPM/BUILD/ipmiutil-3.1.3/util/iseltime.c:125: undefined reference to `ipmi_cmdraw'
	/usr/bin/ld.default: iseltime.o: in function `main':
	/usr/src/RPM/BUILD/ipmiutil-3.1.3/util/iseltime.c:229: undefined reference to
	`parse_lan_options'
	/usr/bin/ld.default: /usr/src/RPM/BUILD/ipmiutil-3.1.3/util/iseltime.c:235: undefined
	reference to `print_lan_opt_usage'
	/usr/bin/ld.default: /usr/src/RPM/BUILD/ipmiutil-3.1.3/util/iseltime.c:239: undefined
	reference to `ipmi_getdeviceid'
	/usr/bin/ld.default: /usr/src/RPM/BUILD/ipmiutil-3.1.3/util/iseltime.c:241: undefined
	reference to `show_outcome'
	/usr/bin/ld.default: /usr/src/RPM/BUILD/ipmiutil-3.1.3/util/iseltime.c:242: undefined
	reference to `ipmi_close_'
	/usr/bin/ld.default: iseltime.o: in function `get_sel_utc':
	/usr/src/RPM/BUILD/ipmiutil-3.1.3/util/iseltime.c:98: undefined reference to `ipmi_cmdraw'
	/usr/bin/ld.default: iseltime.o: in function `main':
	/usr/src/RPM/BUILD/ipmiutil-3.1.3/util/iseltime.c:292: undefined reference to `is_remote'
	/usr/bin/ld.default: /usr/src/RPM/BUILD/ipmiutil-3.1.3/util/iseltime.c:300: undefined
	reference to `ipmi_close_'
	/usr/bin/ld.default: /usr/src/RPM/BUILD/ipmiutil-3.1.3/util/iseltime.c:301: undefined
	reference to `show_outcome'
	/usr/bin/ld.default: /usr/src/RPM/BUILD/ipmiutil-3.1.3/util/iseltime.c:264: undefined
	reference to `ipmi_close_'

jboss-common-core-0:2.5.0-alt1_7jpp8
	[ERROR]
	testGarbageCollectedClassLoader(org.jboss.test.util.test.loading.ConstructorTCCLClassLoaderSourceUnitTestCase)
	Time elapsed: 0.011 s  <<< FAILURE!
	junit.framework.AssertionFailedError: ClassLoader garbage collected
	at
	org.jboss.test.util.test.loading.ConstructorTCCLClassLoaderSourceUnitTestCase.testGarbageCollectedClassLoader(ConstructorTCCLClassLoaderSourceUnitTestCase.java:63)

kernel-image-un-def-1:5.7.19-alt1
	line 248: Deprecated PreReq converted to Requires(pre,postun): Prereq: kernel-image-un-def
	= 1:5.7.19-alt1
	line 266: Deprecated PreReq converted to Requires(pre,postun): Prereq: coreutils
	line 267: Deprecated PreReq converted to Requires(pre,postun): Prereq: module-init-tools
	>= 3.1
	line 268: Deprecated PreReq converted to Requires(pre,postun): Prereq: kernel-image-un-def
	= 1:5.7.19-alt1
	line 292: Deprecated PreReq converted to Requires(pre,postun): Prereq: coreutils
	line 293: Deprecated PreReq converted to Requires(pre,postun): Prereq: module-init-tools
	>= 3.1
	line 294: Deprecated PreReq converted to Requires(pre,postun): Prereq: kernel-image-un-def
	= 1:5.7.19-alt1
	line 308: Deprecated PreReq converted to Requires(pre,postun): Prereq: coreutils
	line 309: Deprecated PreReq converted to Requires(pre,postun): Prereq: module-init-tools
	>= 3.1
	line 310: Deprecated PreReq converted to Requires(pre,postun): Prereq: kernel-image-un-def
	= 1:5.7.19-alt1

node-iltorb-2.4.5-alt1
	SOLINK_MODULE(target) Release/obj.target/iltorb.node
	x86_64-alt-linux-g++: error: unrecognized command line option '-R'
	make: *** [iltorb.target.mk:146: Release/obj.target/iltorb.node] Error 1
	--
	gyp ERR! build error
	gyp ERR! stack Error: `make` failed with exit code: 2
	gyp ERR! stack	   at ChildProcess.onExit
	(/usr/lib/node_modules/node-gyp/lib/build.js:194:23)

perl-HTTP-Proxy-0.304-alt2
	# socket is non blocking, switching to blocking mode
	#   Failed test 'Read some data from the socket'
	#   at t/23connect.t line 79.
	#   Failed test 'CONNECTed to the TCP server and got the banner'
	#   at t/23connect.t line 80.
	--
	t/23connect.t		(Wstat: 0 Tests: 4 Failed: 2)
	Failed tests:  2-3
	Files=37, Tests=465, 11 wallclock secs ( 0.10 usr  0.03 sys +  4.04 cusr  0.58 csys =
	4.75 CPU)
	Result: FAIL
	Failed 1/37 test programs. 2/465 subtests failed.
	make: *** [Makefile:792: test_dynamic] Error 255

php7-memcache-4.0.5.2-alt7.4.9.alt1
	Time taken	:    8 seconds
	FAILED TEST SUMMARY
	memcache->increment()/decrement() with multiple keys [tests/040.phpt]

python-module-pexpect-4.7.0-alt1
	tests/test_replwrap.py::REPLWrapTestCase::test_bash_env PASSED		 [ 66%]
	tests/test_replwrap.py::REPLWrapTestCase::test_existing_spawn FAILED	 [ 67%]
	tests/test_replwrap.py::REPLWrapTestCase::test_long_running_continuation PASSED [ 67%]
	--
	>			     + command)
	E	    ValueError: Continuation prompt found - input was incomplete:
	E	    echo $HOME

python3-module-pytest-virtualenv-1.7.0-alt2
	Requirement already satisfied: execnet in /usr/lib/python3/site-packages (from
	pytest-shutil->pytest-virtualenv==1.7.0) (1.7.0)
	ERROR: Could not find a version that satisfies the requirement contextlib2 (from
	pytest-shutil->pytest-virtualenv==1.7.0) (from versions: none)
	ERROR: No matching distribution found for contextlib2 (from
	pytest-shutil->pytest-virtualenv==1.7.0)
	ERROR: invocation failed (exit code 1)
	py38 finish: installpkg
	/usr/src/RPM/BUILD/pytest-virtualenv-1.7.0/.tox/.tmp/package/1/pytest-virtualenv-1.7.0.zip
	after 0.91 seconds
	___________________________________ summary ____________________________________
	ERROR:	 py38: InvocationError for command
	/usr/src/RPM/BUILD/pytest-virtualenv-1.7.0/.tox/py38/bin/python -m pip install
	--exists-action w .tox/.tmp/package/1/pytest-virtualenv-1.7.0.zip (exited with code 1)
	cleanup
	/usr/src/RPM/BUILD/pytest-virtualenv-1.7.0/.tox/.tmp/package/1/pytest-virtualenv-1.7.0.zip

python3-module-setuptools-1:46.1.3-alt1
	Requirement already satisfied: execnet in /usr/lib/python3/site-packages (from
	pytest-shutil->pytest-virtualenv>=1.2.7; extra == "tests"->setuptools==46.1.3) (1.7.0)
	ERROR: Could not find a version that satisfies the requirement contextlib2 (from
	pytest-shutil->pytest-virtualenv>=1.2.7; extra == "tests"->setuptools==46.1.3) (from
	versions: none)
	ERROR: No matching distribution found for contextlib2 (from
	pytest-shutil->pytest-virtualenv>=1.2.7; extra == "tests"->setuptools==46.1.3)
	Removing setuptools
	--
	raise CalledProcessError(retcode, cmd)
	subprocess.CalledProcessError: Command
	'['/usr/src/RPM/BUILD/python3-module-setuptools-46.1.3/.tox/py3/bin/python',
	'-m', 'pip', 'install', '--exists-action', 'w', '-e',
	'/usr/src/RPM/BUILD/python3-module-setuptools-46.1.3[tests]']' returned non-zero exit
	status 1.
	ERROR: invocation failed (exit code 1)
	py3 finish: developpkg /usr/src/RPM/BUILD/python3-module-setuptools-46.1.3 after
	3.47 seconds
	___________________________________ summary ____________________________________
	ERROR:	 py3: InvocationError for command
	/usr/src/RPM/BUILD/python3-module-setuptools-46.1.3/.tox/py3/bin/python tools/tox_pip.py
	install --exists-action w -e '/usr/src/RPM/BUILD/python3-module-setuptools-46.1.3[tests]'
	(exited with code 1)

	18 error logs REMOVED from the list
chromium-gost-83.0.4103.61-alt4
custodia-0.6.0-alt6
kde5-digikam-6.4.0-alt4
kernel-image-xenomai-4.19.124-alt1.cip27.13
libgupnp-igd-0.2.5-alt4
mumble-1.3.2-alt1
netcmdplus-0.1.1-alt2
pptp-client-1.8.0-alt1
python-module-backports.os-0.1.1-alt2
python-module-h2-3.0.1-alt3
python-module-hypothesis-3.66.30-alt2
python-module-pytest-4.6.6-alt1
python-module-pytest-benchmark-3.2.2-alt5
python-module-pytest-cov-2.8.1-alt1
python-module-pytest-shutil-1.7.0-alt2
python3-module-PyQtWebEngine-5.13.1-alt2
rosegarden-19.12-alt1
wallpapers-spring-cherry-20090517-alt2

Total 158 error logs.


Sisyphus-cybertalk