[cyber] I: Sisyphus-20201029 i586 beehive_status: +9 -6 (91)

ALT beekeeper hiver altlinux.org
29 16:00:58 MSK 2020


	9 NEW error logs

chromium-86.0.4240.111-alt1
	warning: unknown warning option '-Wno-string-concatenation'; did you mean
	'-Wno-objc-string-concatenation'? [-Wunknown-warning-option]
	warning: unknown warning option '-Wno-max-tokens'; did you mean
	'-Wno-extra-tokens'? [-Wunknown-warning-option]
	3 warnings generated.
	[37863/43186] clang++ -MMD -MF
	obj/third_party/blink/renderer/bindings/modules/v8/v8/v8_usb_recipient.o.d
	-DUSE_UDEV -DUSE_AURA=1 -DUSE_GLIB=1 -DUSE_NSS_CERTS=1 -DUSE_X11=1 -DOFFICIAL_BUILD
	-D_FILE_OFFSET_BITS=64 -D_LARGEFILE_SOURCE -D_LARGEFILE64_SOURCE -DNO_UNWIND_TABLES
	-D_GNU_SOURCE -D__STDC_CONSTANT_MACROS -D__STDC_FORMAT_MACROS -D_FORTIFY_SOURCE=2
	-DNDEBUG -DNVALGRIND -DDYNAMIC_ANNOTATIONS_ENABLED=0 -DBLINK_MODULES_IMPLEMENTATION=1
	-DBLINK_IMPLEMENTATION=1 -DINSIDE_BLINK -DGLIB_VERSION_MAX_ALLOWED=GLIB_VERSION_2_40
	-DGLIB_VERSION_MIN_REQUIRED=GLIB_VERSION_2_40 -DWEBP_EXTERN=extern
	-DVK_USE_PLATFORM_XCB_KHR -DGL_GLEXT_PROTOTYPES -DUSE_GLX -DUSE_EGL
	-DU_USING_ICU_NAMESPACE=0 -DU_ENABLE_DYLOAD=0 -DUSE_CHROMIUM_ICU=1
	-DU_ENABLE_TRACING=1 -DU_ENABLE_RESOURCE_TRACING=0 -DU_STATIC_IMPLEMENTATION
	-DICU_UTIL_DATA_IMPL=ICU_UTIL_DATA_FILE -DUCHAR_TYPE=uint16_t
	-DWEBRTC_NON_STATIC_TRACE_EVENT_HANDLERS=0 -DWEBRTC_CHROMIUM_BUILD -DWEBRTC_POSIX
	-DWEBRTC_LINUX -DABSL_ALLOCATOR_NOTHROW=1 -DWEBRTC_USE_BUILTIN_ISAC_FIX=0
	-DWEBRTC_USE_BUILTIN_ISAC_FLOAT=1 -DWEBRTC_USE_X11 -DHAVE_SCTP -DNO_MAIN_THREAD_WRAPPING
	-DGOOGLE_PROTOBUF_NO_RTTI -DGOOGLE_PROTOBUF_NO_STATIC_INITIALIZER
	-DHAVE_PTHREAD -DSK_CODEC_DECODES_PNG -DSK_CODEC_DECODES_WEBP -DSK_ENCODE_PNG
	-DSK_ENCODE_WEBP -DSK_USER_CONFIG_HEADER=\"../../skia/config/SkUserConfig.h\"
	-DSK_GL -DSK_CODEC_DECODES_JPEG -DSK_ENCODE_JPEG -DSK_USE_LIBGIFCODEC
	-DSK_VULKAN_HEADER=\"../../skia/config/SkVulkanConfig.h\" -DSK_VULKAN=1 -DSK_SUPPORT_GPU=1
	-DSK_GPU_WORKAROUNDS_HEADER=\"gpu/config/gpu_driver_bug_workaround_autogen.h\"
	-DVK_USE_PLATFORM_XCB_KHR -DV8_DEPRECATION_WARNINGS
	-DCRASHPAD_ZLIB_SOURCE_EXTERNAL -DLEVELDB_PLATFORM_CHROMIUM=1
	-DLEVELDB_PLATFORM_CHROMIUM=1 -DSUPPORT_WEBGL2_COMPUTE_CONTEXT=1
	-DWTF_USE_WEBAUDIO_PFFFT=1 -DUSE_BLINK_V8_BINDING_NEW_IDL_INTERFACE
	-DUSE_LIBJPEG_TURBO=1 -DV8_DEPRECATION_WARNINGS -DLIBXSLT_STATIC -I../.. -Igen
	-I../../third_party/perfetto/include -Igen/third_party/perfetto/build_config
	-Igen/third_party/perfetto -I../../third_party/libyuv/include
	-I../../third_party/jsoncpp/source/include -I../../third_party/jsoncpp/generated
	-Igen/shim_headers/opus_shim -Igen/shim_headers/ffmpeg_shim -I../../third_party/libwebp/src
	-I../../third_party/vulkan_headers/include -I../../third_party/khronos -I../../gpu
	-Igen/third_party/dawn/src/include -I../../third_party/dawn/src/include
	-I../../third_party/abseil-cpp -I../../third_party/boringssl/src/include
	-I../../third_party/protobuf/src -Igen/protoc_out -I../../third_party/ced/src
	-I../../third_party/icu/source/common -I../../third_party/icu/source/i18n
	-I../../third_party/webrtc_overrides -I../../third_party/webrtc -Igen/third_party/webrtc
	-I../../third_party/protobuf/src -I../../third_party/skia -I../../third_party/libgifcodec
	-I../../third_party/vulkan/include -I../../third_party/vulkan_headers/include
	-I../../third_party/angle/include -I../../third_party/angle/src/common/third_party/base
	-Igen/angle -I../../third_party/angle/include -I../../v8/include -Igen/v8/include
	-I../../third_party/crashpad/crashpad -I../../third_party/crashpad/crashpad/compat/non_mac
	-I../../third_party/crashpad/crashpad/compat/linux
	-I../../third_party/crashpad/crashpad/compat/non_win -I../../third_party/zlib
	-I../../third_party/libwebm/source -I../../third_party/leveldatabase
	-I../../third_party/leveldatabase/src -I../../third_party/leveldatabase/src/include
	-I../../third_party/mesa_headers -I../../third_party/libjpeg_turbo
	-I../../third_party/iccjpeg -I../../third_party/libpng -I../../third_party/ots/include
	-I../../v8/include -Igen/v8/include -I../../third_party/libxml/src/include
	-I../../third_party/libxml/linux/include -I../../third_party/libxslt/src
	-I../../third_party/snappy/src -I../../third_party/snappy/linux
	-fprofile-sample-use=../../chrome/android/profiles/afdo.prof -fno-strict-aliasing
	--param=ssp-buffer-size=4 -fstack-protector -fno-unwind-tables
	-fno-asynchronous-unwind-tables -fPIC -pthread -fcolor-diagnostics
	-fmerge-all-constants -fcrash-diagnostics-dir=../../tools/clang/crashreports -mllvm
	-instcombine-lower-dbg-declare=0 -m32 -ms
	warning: unknown warning option '-Wno-psabi' [-Wunknown-warning-option]
	warning: unknown warning option '-Wno-string-concatenation'; did you mean
	'-Wno-objc-string-concatenation'? [-Wunknown-warning-option]
	warning: unknown warning option '-Wno-max-tokens'; did you mean
	'-Wno-extra-tokens'? [-Wunknown-warning-option]
	3 warnings generated.
	[37864/43186] clang++ -MMD -MF
	obj/third_party/blink/renderer/bindings/modules/v8/v8/v8_idb_cursor_direction.o.d
	-DUSE_UDEV -DUSE_AURA=1 -DUSE_GLIB=1 -DUSE_NSS_CERTS=1 -DUSE_X11=1 -DOFFICIAL_BUILD
	-D_FILE_OFFSET_BITS=64 -D_LARGEFILE_SOURCE -D_LARGEFILE64_SOURCE -DNO_UNWIND_TABLES
	-D_GNU_SOURCE -D__STDC_CONSTANT_MACROS -D__STDC_FORMAT_MACROS -D_FORTIFY_SOURCE=2
	-DNDEBUG -DNVALGRIND -DDYNAMIC_ANNOTATIONS_ENABLED=0 -DBLINK_MODULES_IMPLEMENTATION=1
	-DBLINK_IMPLEMENTATION=1 -DINSIDE_BLINK -DGLIB_VERSION_MAX_ALLOWED=GLIB_VERSION_2_40
	-DGLIB_VERSION_MIN_REQUIRED=GLIB_VERSION_2_40 -DWEBP_EXTERN=extern
	-DVK_USE_PLATFORM_XCB_KHR -DGL_GLEXT_PROTOTYPES -DUSE_GLX -DUSE_EGL
	-DU_USING_ICU_NAMESPACE=0 -DU_ENABLE_DYLOAD=0 -DUSE_CHROMIUM_ICU=1
	-DU_ENABLE_TRACING=1 -DU_ENABLE_RESOURCE_TRACING=0 -DU_STATIC_IMPLEMENTATION
	-DICU_UTIL_DATA_IMPL=ICU_UTIL_DATA_FILE -DUCHAR_TYPE=uint16_t
	-DWEBRTC_NON_STATIC_TRACE_EVENT_HANDLERS=0 -DWEBRTC_CHROMIUM_BUILD -DWEBRTC_POSIX
	-DWEBRTC_LINUX -DABSL_ALLOCATOR_NOTHROW=1 -DWEBRTC_USE_BUILTIN_ISAC_FIX=0
	-DWEBRTC_USE_BUILTIN_ISAC_FLOAT=1 -DWEBRTC_USE_X11 -DHAVE_SCTP -DNO_MAIN_THREAD_WRAPPING
	-DGOOGLE_PROTOBUF_NO_RTTI -DGOOGLE_PROTOBUF_NO_STATIC_INITIALIZER
	-DHAVE_PTHREAD -DSK_CODEC_DECODES_PNG -DSK_CODEC_DECODES_WEBP -DSK_ENCODE_PNG
	-DSK_ENCODE_WEBP -DSK_USER_CONFIG_HEADER=\"../../skia/config/SkUserConfig.h\"
	-DSK_GL -DSK_CODEC_DECODES_JPEG -DSK_ENCODE_JPEG -DSK_USE_LIBGIFCODEC
	-DSK_VULKAN_HEADER=\"../../skia/config/SkVulkanConfig.h\" -DSK_VULKAN=1 -DSK_SUPPORT_GPU=1
	-DSK_GPU_WORKAROUNDS_HEADER=\"gpu/config/gpu_driver_bug_workaround_autogen.h\"
	-DVK_USE_PLATFORM_XCB_KHR -DV8_DEPRECATION_WARNINGS
	-DCRASHPAD_ZLIB_SOURCE_EXTERNAL -DLEVELDB_PLATFORM_CHROMIUM=1
	-DLEVELDB_PLATFORM_CHROMIUM=1 -DSUPPORT_WEBGL2_COMPUTE_CONTEXT=1
	-DWTF_USE_WEBAUDIO_PFFFT=1 -DUSE_BLINK_V8_BINDING_NEW_IDL_INTERFACE
	-DUSE_LIBJPEG_TURBO=1 -DV8_DEPRECATION_WARNINGS -DLIBXSLT_STATIC -I../.. -Igen
	-I../../third_party/perfetto/include -Igen/third_party/perfetto/build_config
	-Igen/third_party/perfetto -I../../third_party/libyuv/include
	-I../../third_party/jsoncpp/source/include -I../../third_party/jsoncpp/generated
	-Igen/shim_headers/opus_shim -Igen/shim_headers/ffmpeg_shim -I../../third_party/libwebp/src
	-I../../third_party/vulkan_headers/include -I../../third_party/khronos -I../../gpu
	-Igen/third_party/dawn/src/include -I../../third_party/dawn/src/include
	-I../../third_party/abseil-cpp -I../../third_party/boringssl/src/include
	-I../../third_party/protobuf/src -Igen/protoc_out -I../../third_party/ced/src
	-I../../third_party/icu/source/common -I../../third_party/icu/source/i18n
	-I../../third_party/webrtc_overrides -I../../third_party/webrtc -Igen/third_party/webrtc
	-I../../third_party/protobuf/src -I../../third_party/skia -I../../third_party/libgifcodec
	-I../../third_party/vulkan/include -I../../third_party/vulkan_headers/include
	-I../../third_party/angle/include -I../../third_party/angle/src/common/third_party/base
	-Igen/angle -I../../third_party/angle/include -I../../v8/include -Igen/v8/include
	-I../../third_party/crashpad/crashpad -I../../third_party/crashpad/crashpad/compat/non_mac
	-I../../third_party/crashpad/crashpad/compat/linux
	-I../../third_party/crashpad/crashpad/compat/non_win -I../../third_party/zlib
	-I../../third_party/libwebm/source -I../../third_party/leveldatabase
	-I../../third_party/leveldatabase/src -I../../third_party/leveldatabase/src/include
	-I../../third_party/mesa_headers -I../../third_party/libjpeg_turbo
	-I../../third_party/iccjpeg -I../../third_party/libpng -I../../third_party/ots/include
	-I../../v8/include -Igen/v8/include -I../../third_party/libxml/src/include
	-I../../third_party/libxml/linux/include -I../../third_party/libxslt/src
	-I../../third_party/snappy/src -I../../third_party/snappy/linux
	-fprofile-sample-use=../../chrome/android/profiles/afdo.prof -fno-strict-aliasing
	--param=ssp-buffer-size=4 -fstack-protector -fno-unwind-tables
	-fno-asynchronous-unwind-tables -fPIC -pthread -fcolor-diagnostics
	-fmerge-all-constants -fcrash-diagnostics-dir=../../tools/clang/crashreports -mllvm
	-instcombine-lower-dbg-declare=0 -
	hasher-priv: master: time elapsed limit (25000 seconds) exceeded

clisp-1:2.49.92-alt2
	Bye.
	(echo *.erg | grep '*' >/dev/null) || (echo "Test failed:" ; ls -l *erg; echo "To see
	which tests failed, type" ; echo "    cat "`pwd`"/*.erg" ; exit 1)
	Test failed:
	-rw-r--r-- 1 builder builder 848 Oct 29 11:38 socket.erg
	To see which tests failed, type
	cat /usr/src/RPM/BUILD/clisp-2.49.92/src/tests/*.erg

custodia-0.6.0-alt6
	using tox.ini: /usr/src/RPM/BUILD/custodia-0.6.0/tox.ini (pid 2169706)
	'exit code 1' cmd '/usr/bin/python2.7' out '' err 'Traceback (most recent call last):\n
	File "/usr/lib/python3/site-packages/tox/helper/get_version.py", line 3, in <module>\n
	import json\nImportError: No module named json\n'
	using tox-3.20.1 from /usr/lib/python3/site-packages/tox/__init__.py (pid 2169706)
	--
	using tox.ini: /usr/src/RPM/BUILD/custodia-0.6.0/tox.ini (pid 2172373)
	'exit code 1' cmd '/usr/bin/python2.7' out '' err 'Traceback (most recent call last):\n
	File "/usr/lib/python3/site-packages/tox/helper/get_version.py", line 3, in <module>\n
	import json\nImportError: No module named json\n'
	using tox-3.20.1 from /usr/lib/python3/site-packages/tox/__init__.py (pid 2172373)
	--
	self.fail(str(exc))
	E   AssertionError: HTTPSConnectionPool(host='localhost', port=53971): Max
	retries exceeded with url: /forwarder/test/ (Caused by SSLError(SSLError(1, '[SSL:
	TLSV13_ALERT_CERTIFICATE_REQUIRED] tlsv13 alert certificate required (_ssl.c:2623)')))
	=============================== warnings summary ===============================
	--
	=========================== short test summary info ============================
	FAILED tests/test_custodia.py::CustodiaHTTPSTests::test_client_no_client_cert
	================== 1 failed, 161 passed, 1 warning in 42.64s ===================
	ERROR: InvocationError for command /usr/src/RPM/BUILD/custodia-0.6.0/.tox/py38/bin/python
	-m coverage run --parallel -m pytest --capture=no --strict (exited with code 1)
	ERROR: invocation failed (exit code 1)
	✖ FAIL py38 in 47.755 seconds
	___________________________________ summary ____________________________________
	ERROR:	 py38: parallel child exit code 1

gprolog-1.4.5-alt1
	gplc -c --fast-math parse.pl
	Fatal Error: Segmentation Violation (bad address: 0x77c620c0)
	compilation failed

jed-2:0.99.19-alt2.qa2.1
	/usr/bin/ld.default: syntax.o: file not recognized: file truncated
	collect2: error: ld returned 1 exit status
	make[1]: *** [Makefile:157: /usr/src/RPM/BUILD/jed-0.99-19/src/objs/jed] Error 1

python-module-argcomplete-1.9.4-alt2
	test_parse_special_characters_dollar (__main__.TestBashGlobal) ... expected failure
	ERROR
	test_partial_completion (__main__.TestBashGlobal) ... ok
	--
	test_wordbreak_chars (__main__.TestTcsh) ... ok
	ERROR: test_parse_special_characters_dollar (__main__.TestBashGlobal)
	Traceback (most recent call last):
	--
	self.sh.run_command('exit')
	AssertionError: EOF not raised
	Ran 116 tests in 154.088s
	FAILED (errors=1, expected failures=11)
	ERROR: InvocationError for command
	/usr/src/RPM/BUILD/argcomplete-1.9.4/.tox/py27/bin/python test/test.py -v (exited with
	code 1)
	ERROR: invocation failed (exit code 1)
	✖ FAIL py27 in 3 minutes, 4.327 seconds
	___________________________________ summary ____________________________________
	ERROR:	 py27: parallel child exit code 1
	py38: commands succeeded

python-module-pexpect-4.7.0-alt1
	await waiter
	except exceptions.CancelledError:
	if fut.done():
	--
	=========================== short test summary info ============================
	FAILED tests/test_async.py::AsyncTests::test_async_replwrap_multiline - pexpe...
	============ 1 failed, 230 passed, 13 warnings in 163.99s (0:02:43) ============

python3-module-virtualenv-20.1.0-alt1
	SKIPPED [1] tests/unit/activation/conftest.py:249: Fish(
	version=FileNotFoundError(2, 'No such file or directory'),
	creator=CPython3Posix(dest=/usr/src/tmp/pytest-of-builder/pytest-0/popen-gw2/activation-tester-env0/e-$
	èрт🚒♞中片-j, clear=False, global=False),
	interpreter=PythonInfo(spec=CPython3.8.6.final.0-32, system=/usr/bin/python3.8,
	exe=/usr/src/RPM/BUILD/python3-module-virtualenv-20.1.0/.tox/py3/bin/python,
	platform=linux, version='3.8.6 (default, Oct  2 2020, 00:06:33) \n[GCC 9.3.1 20200518
	(ALT Sisyphus 9.3.1-alt1)]', encoding_fs_io=utf-8-utf-8)) is not available due [Errno 2]
	No such file or directory: 'fish'
	SKIPPED [1] tests/unit/test_util.py:19: subprocess patch only applied on Windows python2
	SKIPPED [1] tests/unit/activation/conftest.py:249: Csh(
	version=FileNotFoundError(2, 'No such file or directory'),
	creator=CPython3Posix(dest=/usr/src/tmp/pytest-of-builder/pytest-0/popen-gw4/activation-tester-env0/e-$
	èрт🚒♞中片-j, clear=False, global=False),
	interpreter=PythonInfo(spec=CPython3.8.6.final.0-32, system=/usr/bin/python3.8,
	exe=/usr/src/RPM/BUILD/python3-module-virtualenv-20.1.0/.tox/py3/bin/python,
	platform=linux, version='3.8.6 (default, Oct  2 2020, 00:06:33) \n[GCC 9.3.1 20200518
	(ALT Sisyphus 9.3.1-alt1)]', encoding_fs_io=utf-8-utf-8)) is not available due [Errno 2]
	No such file or directory: 'csh'
	SKIPPED [1] tests/unit/activation/conftest.py:249: Fish(
	version=FileNotFoundError(2, 'No such file or directory'),
	creator=CPython3Posix(dest=/usr/src/tmp/pytest-of-builder/pytest-0/popen-gw7/activation-tester-env0/e-$
	èрт🚒♞中片-j, clear=False, global=False),
	interpreter=PythonInfo(spec=CPython3.8.6.final.0-32, system=/usr/bin/python3.8,
	exe=/usr/src/RPM/BUILD/python3-module-virtualenv-20.1.0/.tox/py3/bin/python,
	platform=linux, version='3.8.6 (default, Oct  2 2020, 00:06:33) \n[GCC 9.3.1 20200518
	(ALT Sisyphus 9.3.1-alt1)]', encoding_fs_io=utf-8-utf-8)) is not available due [Errno 2]
	No such file or directory: 'fish'
	SKIPPED [2] tests/conftest.py:344: could not find 2
	--
	SKIPPED [1] tests/unit/activation/conftest.py:249: Csh(
	version=FileNotFoundError(2, 'No such file or directory'),
	creator=CPython3Posix(dest=/usr/src/tmp/pytest-of-builder/pytest-0/popen-gw2/activation-tester-env1/e-$
	èрт🚒♞中片-j, clear=False, global=False),
	interpreter=PythonInfo(spec=CPython3.8.6.final.0-32, system=/usr/bin/python3.8,
	exe=/usr/src/RPM/BUILD/python3-module-virtualenv-20.1.0/.tox/py3/bin/python,
	platform=linux, version='3.8.6 (default, Oct  2 2020, 00:06:33) \n[GCC 9.3.1 20200518
	(ALT Sisyphus 9.3.1-alt1)]', encoding_fs_io=utf-8-utf-8)) is not available due [Errno 2]
	No such file or directory: 'csh'
	SKIPPED [1] tests/unit/discovery/windows/test_windows_pep514.py:14: no Windows registry
	--
	SKIPPED [1] tests/unit/activation/conftest.py:249: PowerShell(
	version=FileNotFoundError(2, 'No such file or directory'),
	creator=CPython3Posix(dest=/usr/src/tmp/pytest-of-builder/pytest-0/popen-gw5/activation-tester-env0/e-$
	èрт🚒♞中片-j, clear=False, global=False),
	interpreter=PythonInfo(spec=CPython3.8.6.final.0-32, system=/usr/bin/python3.8,
	exe=/usr/src/RPM/BUILD/python3-module-virtualenv-20.1.0/.tox/py3/bin/python,
	platform=linux, version='3.8.6 (default, Oct  2 2020, 00:06:33) \n[GCC 9.3.1 20200518
	(ALT Sisyphus 9.3.1-alt1)]', encoding_fs_io=utf-8-utf-8)) is not available due [Errno 2]
	No such file or directory: 'pwsh'
	SKIPPED [1] tests/unit/activation/conftest.py:249: PowerShell(

sbcl-2.0.4-alt1
	; wrote
	/usr/src/RPM/BUILD/sbcl-2.0.4/sbcl-2.0.4/obj/asdf-cache/sb-cover/test-data-branching-forms.fasl
	; compilation finished in 0:00:00.001
	; compiling file
	"/usr/src/RPM/BUILD/sbcl-2.0.4/sbcl-2.0.4/contrib/sb-cover/test-data-4.lisp" (written
	06 MAY 2020 02:00:12 PM):
	; wrote /usr/src/RPM/BUILD/sbcl-2.0.4/sbcl-2.0.4/obj/asdf-cache/sb-cover/test-data-4.fasl
	; compilation finished in 0:00:00.001
	* make[1]: Leaving directory '/usr/src/RPM/BUILD/sbcl-2.0.4/sbcl-2.0.4/contrib/sb-cover'
	make: Leaving directory '/usr/src/RPM/BUILD/sbcl-2.0.4/sbcl-2.0.4/contrib'
	WARNING! Some of the contrib modules did not build successfully or pass
	their self-tests. Failed contribs:"
	sb-concurrency

	6 error logs REMOVED from the list
atlas-3.9.35-alt1.qa1
chromium-gost-86.0.4240.111-alt1
ghc8.6.4-sha-1.6.4.4-alt1
guile30-3.0.4-alt1
java-atk-wrapper-0.33.2.1-alt1_0.pre01jpp8
libgupnp-igd-1.2.0-alt1

Total 91 error logs.


Sisyphus-cybertalk