[cyber] I: Sisyphus-20201029 x86_64 beehive_status: +7 -8 (90)

ALT beekeeper hiver altlinux.org
29 08:55:27 MSK 2020


	7 NEW error logs

aqbanking-6.0.1-alt1
	make[5]: Entering directory
	'/usr/src/RPM/BUILD/aqbanking-6.0.1/src/libs/plugins/backends/aqebics'
	make[5]: *** No rule to make target 'built_sources'.  Stop.
	make[5]: Leaving directory
	'/usr/src/RPM/BUILD/aqbanking-6.0.1/src/libs/plugins/backends/aqebics'
	--
	make[1]: Entering directory '/usr/src/RPM/BUILD/aqbanking-6.0.1'
	cat: ./i18nsources: No such file or directory
	make[1]: Leaving directory '/usr/src/RPM/BUILD/aqbanking-6.0.1'
	--
	make[5]: Entering directory
	'/usr/src/RPM/BUILD/aqbanking-6.0.1/src/libs/aqbanking/backendsupport'
	make[5]: *** No rule to make target 'jobqueue.c', needed by 'jobqueue.lo'.  Stop.
	make[5]: Leaving directory
	'/usr/src/RPM/BUILD/aqbanking-6.0.1/src/libs/aqbanking/backendsupport'

custodia-0.6.0-alt6
	using tox.ini: /usr/src/RPM/BUILD/custodia-0.6.0/tox.ini (pid 3315460)
	'exit code 1' cmd '/usr/bin/python2.7' out '' err 'Traceback (most recent call last):\n
	File "/usr/lib/python3/site-packages/tox/helper/get_version.py", line 3, in <module>\n
	import json\nImportError: No module named json\n'
	using tox-3.20.1 from /usr/lib/python3/site-packages/tox/__init__.py (pid 3315460)
	--
	using tox.ini: /usr/src/RPM/BUILD/custodia-0.6.0/tox.ini (pid 3322766)
	'exit code 1' cmd '/usr/bin/python2.7' out '' err 'Traceback (most recent call last):\n
	File "/usr/lib/python3/site-packages/tox/helper/get_version.py", line 3, in <module>\n
	import json\nImportError: No module named json\n'
	using tox-3.20.1 from /usr/lib/python3/site-packages/tox/__init__.py (pid 3322766)
	--
	self.fail(str(exc))
	E   AssertionError: HTTPSConnectionPool(host='localhost', port=52669): Max
	retries exceeded with url: /forwarder/test/ (Caused by SSLError(SSLError(1, '[SSL:
	TLSV13_ALERT_CERTIFICATE_REQUIRED] tlsv13 alert certificate required (_ssl.c:2623)')))
	=============================== warnings summary ===============================
	--
	=========================== short test summary info ============================
	FAILED tests/test_custodia.py::CustodiaHTTPSTests::test_client_no_client_cert
	============= 1 failed, 161 passed, 1 warning in 60.74s (0:01:00) ==============
	ERROR: InvocationError for command /usr/src/RPM/BUILD/custodia-0.6.0/.tox/py38/bin/python
	-m coverage run --parallel -m pytest --capture=no --strict (exited with code 1)
	ERROR: invocation failed (exit code 1)
	✖ FAIL py38 in 1 minute, 12.999 seconds
	___________________________________ summary ____________________________________
	ERROR:	 py38: parallel child exit code 1

jed-2:0.99.19-alt2.qa2.1
	make[1]: Entering directory '/usr/src/RPM/BUILD/jed-0.99-19/src'
	cd /usr/src/RPM/BUILD/jed-0.99-19/src/objs; x86_64-alt-linux-gcc -c -pipe
	-frecord-gcc-switches -Wall -g -O2   -I/usr/include/freetype2 -I/usr/include/harfbuzz
	-I/usr/include/glib-2.0 -I/usr/lib64/glib-2.0/include  -Dunix -DJED -DUSE_GPM_MOUSE
	-I/usr/include/slang -I/usr/include/freetype2 -I/usr/include/harfbuzz
	-I/usr/include/glib-2.0 -I/usr/lib64/glib-2.0/include -I/usr/include/freetype2
	/usr/src/RPM/BUILD/jed-0.99-19/src/xterm.c
	make[1]: Leaving directory '/usr/src/RPM/BUILD/jed-0.99-19/src'
	make[1]: Entering directory '/usr/src/RPM/BUILD/jed-0.99-19/src'
	cd /usr/src/RPM/BUILD/jed-0.99-19/src/objs; \
	x86_64-alt-linux-gcc buffer.o cmds.o misc.o file.o ins.o sig.o sysdep.o screen.o paste.o
	ledit.o line.o search.o text.o keymap.o replace.o window.o undo.o vfile.o intrin.o syntax.o
	abbrev.o indent.o jprocess.o lineattr.o blocal.o mouse.o userinfo.o lock.o version.o
	hooks.o colors.o main.o jedwin.o xterm.o vterm.o menu.o -o xjed -Wl,-export-dynamic
	-lslang -lgpm	-lutil	-lm -ldl   -lX11  -lutil  -lm -ldl -lXft
	make[1]: Leaving directory '/usr/src/RPM/BUILD/jed-0.99-19/src'
	make[1]: Entering directory '/usr/src/RPM/BUILD/jed-0.99-19/src'
	xjed created in /usr/src/RPM/BUILD/jed-0.99-19/src/objs
	make[1]: Leaving directory '/usr/src/RPM/BUILD/jed-0.99-19/src'

libgupnp-igd-1.2.0-alt1
	Full log written to
	/usr/src/RPM/BUILD/gupnp-igd-1.2.0/x86_64-alt-linux/meson-logs/testlog.txt
	FAILED: meson-test
	/usr/bin/meson test --no-rebuild --print-errorlogs

python3-3.8.6-alt1
	1 test failed:
	test_signal
	20 tests skipped:
	test_curses test_devpoll test_ioctl test_kqueue test_msilib
	test_ossaudiodev test_smtpnet test_socketserver test_startfile
	test_timeout test_tix test_tk test_ttk_guionly test_urllib2net
	test_urllibnet test_winconsoleio test_winreg test_winsound
	test_xmlrpc_net test_zipfile64
	Total duration: 3 min 28 sec
	Tests result: FAILURE

python3-module-iniparse-0.5-alt1
	E
	ERROR: test_queue (tests.test_multiprocessing.TestIni)
	Traceback (most recent call last):
	--
	Ran 96 tests in 1.205s
	FAILED (errors=1, skipped=1)

python3-module-virtualenv-20.1.0-alt1
	SKIPPED [1] tests/unit/activation/conftest.py:249: Fish(
	version=FileNotFoundError(2, 'No such file or directory'),
	creator=CPython3Posix(dest=/usr/src/tmp/pytest-of-builder/pytest-0/popen-gw0/activation-tester-env0/e-$
	èрт🚒♞中片-j, clear=False, global=False),
	interpreter=PythonInfo(spec=CPython3.8.6.final.0-64, system=/usr/bin/python3.8,
	exe=/usr/src/RPM/BUILD/python3-module-virtualenv-20.1.0/.tox/py3/bin/python,
	platform=linux, version='3.8.6 (default, Oct  2 2020, 00:06:33) \n[GCC 9.3.1 20200518
	(ALT Sisyphus 9.3.1-alt1)]', encoding_fs_io=utf-8-utf-8)) is not available due [Errno 2]
	No such file or directory: 'fish'
	SKIPPED [1] tests/unit/activation/conftest.py:249: Csh(
	version=FileNotFoundError(2, 'No such file or directory'),
	creator=CPython3Posix(dest=/usr/src/tmp/pytest-of-builder/pytest-0/popen-gw2/activation-tester-env0/e-$
	èрт🚒♞中片-j, clear=False, global=False),
	interpreter=PythonInfo(spec=CPython3.8.6.final.0-64, system=/usr/bin/python3.8,
	exe=/usr/src/RPM/BUILD/python3-module-virtualenv-20.1.0/.tox/py3/bin/python,
	platform=linux, version='3.8.6 (default, Oct  2 2020, 00:06:33) \n[GCC 9.3.1 20200518
	(ALT Sisyphus 9.3.1-alt1)]', encoding_fs_io=utf-8-utf-8)) is not available due [Errno 2]
	No such file or directory: 'csh'
	SKIPPED [2] tests/unit/activation/conftest.py:246: BatchActivator not supported
	SKIPPED [1] tests/unit/activation/conftest.py:249: Fish(
	version=FileNotFoundError(2, 'No such file or directory'),
	creator=CPython3Posix(dest=/usr/src/tmp/pytest-of-builder/pytest-0/popen-gw4/activation-tester-env1/e-$
	èрт🚒♞中片-j, clear=False, global=False),
	interpreter=PythonInfo(spec=CPython3.8.6.final.0-64, system=/usr/bin/python3.8,
	exe=/usr/src/RPM/BUILD/python3-module-virtualenv-20.1.0/.tox/py3/bin/python,
	platform=linux, version='3.8.6 (default, Oct  2 2020, 00:06:33) \n[GCC 9.3.1 20200518
	(ALT Sisyphus 9.3.1-alt1)]', encoding_fs_io=utf-8-utf-8)) is not available due [Errno 2]
	No such file or directory: 'fish'
	SKIPPED [2] tests/unit/create/test_creator.py:510: stdlib components without py files
	only possible on CPython2
	--
	SKIPPED [1] tests/unit/activation/conftest.py:249: Csh(
	version=FileNotFoundError(2, 'No such file or directory'),
	creator=CPython3Posix(dest=/usr/src/tmp/pytest-of-builder/pytest-0/popen-gw0/activation-tester-env1/e-$
	èрт🚒♞中片-j, clear=False, global=False),
	interpreter=PythonInfo(spec=CPython3.8.6.final.0-64, system=/usr/bin/python3.8,
	exe=/usr/src/RPM/BUILD/python3-module-virtualenv-20.1.0/.tox/py3/bin/python,
	platform=linux, version='3.8.6 (default, Oct  2 2020, 00:06:33) \n[GCC 9.3.1 20200518
	(ALT Sisyphus 9.3.1-alt1)]', encoding_fs_io=utf-8-utf-8)) is not available due [Errno 2]
	No such file or directory: 'csh'
	SKIPPED [1] tests/unit/create/test_creator.py:281: python 2 only tests
	SKIPPED [1] tests/unit/activation/conftest.py:249: PowerShell(
	version=FileNotFoundError(2, 'No such file or directory'),
	creator=CPython3Posix(dest=/usr/src/tmp/pytest-of-builder/pytest-0/popen-gw2/activation-tester-env0/e-$
	èрт🚒♞中片-j, clear=False, global=False),
	interpreter=PythonInfo(spec=CPython3.8.6.final.0-64, system=/usr/bin/python3.8,
	exe=/usr/src/RPM/BUILD/python3-module-virtualenv-20.1.0/.tox/py3/bin/python,
	platform=linux, version='3.8.6 (default, Oct  2 2020, 00:06:33) \n[GCC 9.3.1 20200518
	(ALT Sisyphus 9.3.1-alt1)]', encoding_fs_io=utf-8-utf-8)) is not available due [Errno 2]
	No such file or directory: 'pwsh'
	SKIPPED [1] tests/unit/activation/conftest.py:249: PowerShell(

	8 error logs REMOVED from the list
chromium-86.0.4240.111-alt1
chromium-gost-86.0.4240.111-alt1
cilk-5.4.6-alt11
erlang-proper-1.3-alt2
farstream0.2-0.2.9.1-alt0.1
libopenh264-2.1.1-alt1
perl-Net-SIP-0.823-alt1
python-module-pexpect-4.7.0-alt1

Total 90 error logs.


Sisyphus-cybertalk