[cyber] I: Sisyphus-20201026 x86_64 beehive_status: +13 -9 (90)

ALT beekeeper hiver altlinux.org
26 10:09:48 MSK 2020


	13 NEW error logs

chromium-86.0.4240.111-alt1
	warning: unknown warning option '-Wno-string-concatenation'; did you mean
	'-Wno-objc-string-concatenation'? [-Wunknown-warning-option]
	warning: unknown warning option '-Wno-max-tokens'; did you mean
	'-Wno-extra-tokens'? [-Wunknown-warning-option]
	3 warnings generated.
	[31695/43241] clang++ -MMD -MF obj/chrome/browser/ui/ui/status_tray_linux.o.d -DUSE_DBUS
	-DUSE_DBUS_MENU -DUSE_UDEV -DUSE_AURA=1 -DUSE_GLIB=1 -DUSE_NSS_CERTS=1 -DUSE_X11=1
	-DOFFICIAL_BUILD -D_FILE_OFFSET_BITS=64 -D_LARGEFILE_SOURCE -D_LARGEFILE64_SOURCE
	-DNO_UNWIND_TABLES -D_GNU_SOURCE -D__STDC_CONSTANT_MACROS -D__STDC_FORMAT_MACROS
	-D_FORTIFY_SOURCE=2 -DNDEBUG -DNVALGRIND -DDYNAMIC_ANNOTATIONS_ENABLED=0 -DUSE_CUPS
	-DGLIB_VERSION_MAX_ALLOWED=GLIB_VERSION_2_40 -DGLIB_VERSION_MIN_REQUIRED=GLIB_VERSION_2_40
	-DWEBP_EXTERN=extern -DVK_USE_PLATFORM_XCB_KHR -DGL_GLEXT_PROTOTYPES
	-DUSE_GLX -DUSE_EGL -DTOOLKIT_VIEWS=1 -DSYNC_PASSWORD_REUSE_DETECTION_ENABLED
	-DSYNC_PASSWORD_REUSE_WARNING_ENABLED -DON_FOCUS_PING_ENABLED -DGOOGLE_PROTOBUF_NO_RTTI
	-DGOOGLE_PROTOBUF_NO_STATIC_INITIALIZER -DHAVE_PTHREAD -DLEVELDB_PLATFORM_CHROMIUM=1
	-DLEVELDB_PLATFORM_CHROMIUM=1 -DU_USING_ICU_NAMESPACE=0 -DU_ENABLE_DYLOAD=0
	-DUSE_CHROMIUM_ICU=1 -DU_ENABLE_TRACING=1 -DU_ENABLE_RESOURCE_TRACING=0
	-DU_STATIC_IMPLEMENTATION -DICU_UTIL_DATA_IMPL=ICU_UTIL_DATA_FILE -DUCHAR_TYPE=uint16_t
	-DWEBRTC_NON_STATIC_TRACE_EVENT_HANDLERS=0 -DWEBRTC_CHROMIUM_BUILD -DWEBRTC_POSIX
	-DWEBRTC_LINUX -DABSL_ALLOCATOR_NOTHROW=1 -DWEBRTC_USE_BUILTIN_ISAC_FIX=0
	-DWEBRTC_USE_BUILTIN_ISAC_FLOAT=1 -DWEBRTC_USE_X11 -DHAVE_SCTP
	-DNO_MAIN_THREAD_WRAPPING -DSK_CODEC_DECODES_PNG -DSK_CODEC_DECODES_WEBP -DSK_ENCODE_PNG
	-DSK_ENCODE_WEBP -DSK_USER_CONFIG_HEADER=\"../../skia/config/SkUserConfig.h\"
	-DSK_GL -DSK_CODEC_DECODES_JPEG -DSK_ENCODE_JPEG -DSK_USE_LIBGIFCODEC
	-DSK_VULKAN_HEADER=\"../../skia/config/SkVulkanConfig.h\" -DSK_VULKAN=1 -DSK_SUPPORT_GPU=1
	-DSK_GPU_WORKAROUNDS_HEADER=\"gpu/config/gpu_driver_bug_workaround_autogen.h\"
	-DVK_USE_PLATFORM_XCB_KHR -DCRASHPAD_ZLIB_SOURCE_EXTERNAL
	-DV8_USE_EXTERNAL_STARTUP_DATA -DV8_COMPRESS_POINTERS -DV8_31BIT_SMIS_ON_64BIT_ARCH
	-DV8_DEPRECATION_WARNINGS -DATK_LIB_DIR=\"/usr/lib64\" -DUSE_ATK_BRIDGE
	-DI18N_ADDRESS_VALIDATION_DATA_URL=\"https://chromium-i18n.appspot.com/ssl-aggregate-address/\"
	-DPERFETTO_IMPLEMENTATION -I../.. -Igen -I../../third_party/perfetto/include
	-Igen/third_party/perfetto/build_config -Igen/third_party/perfetto
	-I../../third_party/libyuv/include -I../../third_party/jsoncpp/source/include
	-I../../third_party/jsoncpp/generated -Igen/shim_headers/opus_shim
	-Igen/shim_headers/ffmpeg_shim -I../../third_party/libwebp/src
	-I../../third_party/vulkan_headers/include -I../../third_party/khronos
	-I../../gpu -Igen/third_party/dawn/src/include -I../../third_party/dawn/src/include
	-I../../third_party/protobuf/src -Igen/protoc_out -I../../third_party/protobuf/src
	-I../../third_party/abseil-cpp -I../../third_party/boringssl/src/include
	-Igen -Igen/third_party/metrics_proto -I../../third_party/leveldatabase
	-I../../third_party/leveldatabase/src -I../../third_party/leveldatabase/src/include
	-I../../third_party/ced/src -I../../third_party/icu/source/common
	-I../../third_party/icu/source/i18n -I../../third_party/webrtc_overrides
	-I../../third_party/webrtc -Igen/third_party/webrtc -I../../third_party/skia
	-I../../third_party/libgifcodec -I../../third_party/vulkan/include
	-I../../third_party/vulkan_headers/include -I../../third_party/crashpad/crashpad
	-I../../third_party/crashpad/crashpad/compat/non_mac
	-I../../third_party/crashpad/crashpad/compat/linux
	-I../../third_party/crashpad/crashpad/compat/non_win -I../../third_party/zlib
	-I../../third_party/libwebm/source -I../../third_party/mesa_headers -I../../v8/include
	-Igen/v8/include -Igen -Igen/components/policy/proto -I../../third_party/re2/src
	-Igen -Igen -Igen -Igen -I../../third_party/libaddressinput/src/cpp/include -Igen
	-Igen -I../../third_party/flatbuffers/src/include -I../../third_party/perfetto
	-I../../third_party/perfetto/include -Igen/third_party/perfetto/build_config
	-Igen/third_party/perfetto -I../../third_party/brotli/include -Igen -Igen -Igen
	-Igen -Igen -Igen -fprofile-sample-use=../../chrome/android/profiles/afdo.prof
	-fno-strict-aliasing --param=ssp-buffer-size=4 -fstack-protector -fno-unwind-tables
	-fno-asynchronous-unwind-tables -fPIC -pthread -fcolor-diagnostics -fmerge-all-c
	warning: unknown warning option '-Wno-psabi' [-Wunknown-warning-option]
	warning: unknown warning option '-Wno-string-concatenation'; did you mean
	'-Wno-objc-string-concatenation'? [-Wunknown-warning-option]
	warning: unknown warning option '-Wno-max-tokens'; did you mean
	'-Wno-extra-tokens'? [-Wunknown-warning-option]
	3 warnings generated.
	[31696/43241] clang++ -MMD -MF obj/chrome/browser/ui/ui/chrome_views_delegate_linux.o.d
	-DUSE_DBUS -DUSE_DBUS_MENU -DUSE_UDEV -DUSE_AURA=1 -DUSE_GLIB=1
	-DUSE_NSS_CERTS=1 -DUSE_X11=1 -DOFFICIAL_BUILD -D_FILE_OFFSET_BITS=64
	-D_LARGEFILE_SOURCE -D_LARGEFILE64_SOURCE -DNO_UNWIND_TABLES -D_GNU_SOURCE
	-D__STDC_CONSTANT_MACROS -D__STDC_FORMAT_MACROS -D_FORTIFY_SOURCE=2
	-DNDEBUG -DNVALGRIND -DDYNAMIC_ANNOTATIONS_ENABLED=0 -DUSE_CUPS
	-DGLIB_VERSION_MAX_ALLOWED=GLIB_VERSION_2_40 -DGLIB_VERSION_MIN_REQUIRED=GLIB_VERSION_2_40
	-DWEBP_EXTERN=extern -DVK_USE_PLATFORM_XCB_KHR -DGL_GLEXT_PROTOTYPES
	-DUSE_GLX -DUSE_EGL -DTOOLKIT_VIEWS=1 -DSYNC_PASSWORD_REUSE_DETECTION_ENABLED
	-DSYNC_PASSWORD_REUSE_WARNING_ENABLED -DON_FOCUS_PING_ENABLED -DGOOGLE_PROTOBUF_NO_RTTI
	-DGOOGLE_PROTOBUF_NO_STATIC_INITIALIZER -DHAVE_PTHREAD -DLEVELDB_PLATFORM_CHROMIUM=1
	-DLEVELDB_PLATFORM_CHROMIUM=1 -DU_USING_ICU_NAMESPACE=0 -DU_ENABLE_DYLOAD=0
	-DUSE_CHROMIUM_ICU=1 -DU_ENABLE_TRACING=1 -DU_ENABLE_RESOURCE_TRACING=0
	-DU_STATIC_IMPLEMENTATION -DICU_UTIL_DATA_IMPL=ICU_UTIL_DATA_FILE -DUCHAR_TYPE=uint16_t
	-DWEBRTC_NON_STATIC_TRACE_EVENT_HANDLERS=0 -DWEBRTC_CHROMIUM_BUILD -DWEBRTC_POSIX
	-DWEBRTC_LINUX -DABSL_ALLOCATOR_NOTHROW=1 -DWEBRTC_USE_BUILTIN_ISAC_FIX=0
	-DWEBRTC_USE_BUILTIN_ISAC_FLOAT=1 -DWEBRTC_USE_X11 -DHAVE_SCTP
	-DNO_MAIN_THREAD_WRAPPING -DSK_CODEC_DECODES_PNG -DSK_CODEC_DECODES_WEBP -DSK_ENCODE_PNG
	-DSK_ENCODE_WEBP -DSK_USER_CONFIG_HEADER=\"../../skia/config/SkUserConfig.h\"
	-DSK_GL -DSK_CODEC_DECODES_JPEG -DSK_ENCODE_JPEG -DSK_USE_LIBGIFCODEC
	-DSK_VULKAN_HEADER=\"../../skia/config/SkVulkanConfig.h\" -DSK_VULKAN=1 -DSK_SUPPORT_GPU=1
	-DSK_GPU_WORKAROUNDS_HEADER=\"gpu/config/gpu_driver_bug_workaround_autogen.h\"
	-DVK_USE_PLATFORM_XCB_KHR -DCRASHPAD_ZLIB_SOURCE_EXTERNAL
	-DV8_USE_EXTERNAL_STARTUP_DATA -DV8_COMPRESS_POINTERS -DV8_31BIT_SMIS_ON_64BIT_ARCH
	-DV8_DEPRECATION_WARNINGS -DATK_LIB_DIR=\"/usr/lib64\" -DUSE_ATK_BRIDGE
	-DI18N_ADDRESS_VALIDATION_DATA_URL=\"https://chromium-i18n.appspot.com/ssl-aggregate-address/\"
	-DPERFETTO_IMPLEMENTATION -I../.. -Igen -I../../third_party/perfetto/include
	-Igen/third_party/perfetto/build_config -Igen/third_party/perfetto
	-I../../third_party/libyuv/include -I../../third_party/jsoncpp/source/include
	-I../../third_party/jsoncpp/generated -Igen/shim_headers/opus_shim
	-Igen/shim_headers/ffmpeg_shim -I../../third_party/libwebp/src
	-I../../third_party/vulkan_headers/include -I../../third_party/khronos
	-I../../gpu -Igen/third_party/dawn/src/include -I../../third_party/dawn/src/include
	-I../../third_party/protobuf/src -Igen/protoc_out -I../../third_party/protobuf/src
	-I../../third_party/abseil-cpp -I../../third_party/boringssl/src/include
	-Igen -Igen/third_party/metrics_proto -I../../third_party/leveldatabase
	-I../../third_party/leveldatabase/src -I../../third_party/leveldatabase/src/include
	-I../../third_party/ced/src -I../../third_party/icu/source/common
	-I../../third_party/icu/source/i18n -I../../third_party/webrtc_overrides
	-I../../third_party/webrtc -Igen/third_party/webrtc -I../../third_party/skia
	-I../../third_party/libgifcodec -I../../third_party/vulkan/include
	-I../../third_party/vulkan_headers/include -I../../third_party/crashpad/crashpad
	-I../../third_party/crashpad/crashpad/compat/non_mac
	-I../../third_party/crashpad/crashpad/compat/linux
	-I../../third_party/crashpad/crashpad/compat/non_win -I../../third_party/zlib
	-I../../third_party/libwebm/source -I../../third_party/mesa_headers -I../../v8/include
	-Igen/v8/include -Igen -Igen/components/policy/proto -I../../third_party/re2/src
	-Igen -Igen -Igen -Igen -I../../third_party/libaddressinput/src/cpp/include -Igen
	-Igen -I../../third_party/flatbuffers/src/include -I../../third_party/perfetto
	-I../../third_party/perfetto/include -Igen/third_party/perfetto/build_config
	-Igen/third_party/perfetto -I../../third_party/brotli/include -Igen -Igen -Igen
	-Igen -Igen -Igen -fprofile-sample-use=../../chrome/android/profiles/afdo.prof
	-fno-strict-aliasing --param=ssp-buffer-size=4 -fstack-protector -fno-unwind-tables
	-fno-asynchronous-unwind-tables -fPIC -pthread -fcolor-diagnostics -fm
	hasher-priv: master: time elapsed limit (25000 seconds) exceeded

custodia-0.6.0-alt6
	using tox.ini: /usr/src/RPM/BUILD/custodia-0.6.0/tox.ini (pid 2285987)
	'exit code 1' cmd '/usr/bin/python2.7' out '' err 'Traceback (most recent call last):\n
	File "/usr/lib/python3/site-packages/tox/helper/get_version.py", line 3, in <module>\n
	import json\nImportError: No module named json\n'
	using tox-3.20.1 from /usr/lib/python3/site-packages/tox/__init__.py (pid 2285987)
	--
	using tox.ini: /usr/src/RPM/BUILD/custodia-0.6.0/tox.ini (pid 2287646)
	'exit code 1' cmd '/usr/bin/python2.7' out '' err 'Traceback (most recent call last):\n
	File "/usr/lib/python3/site-packages/tox/helper/get_version.py", line 3, in <module>\n
	import json\nImportError: No module named json\n'
	using tox-3.20.1 from /usr/lib/python3/site-packages/tox/__init__.py (pid 2287646)
	--
	self.fail(str(exc))
	E   AssertionError: HTTPSConnectionPool(host='localhost', port=58637): Max
	retries exceeded with url: /forwarder/test/ (Caused by SSLError(SSLError(1, '[SSL:
	TLSV13_ALERT_CERTIFICATE_REQUIRED] tlsv13 alert certificate required (_ssl.c:2623)')))
	=============================== warnings summary ===============================
	--
	=========================== short test summary info ============================
	FAILED tests/test_custodia.py::CustodiaHTTPSTests::test_client_no_client_cert
	============= 1 failed, 161 passed, 1 warning in 78.04s (0:01:18) ==============
	ERROR: InvocationError for command /usr/src/RPM/BUILD/custodia-0.6.0/.tox/py38/bin/python
	-m coverage run --parallel -m pytest --capture=no --strict (exited with code 1)
	ERROR: invocation failed (exit code 1)
	✖ FAIL py38 in 1 minute, 30.931 seconds
	___________________________________ summary ____________________________________
	ERROR:	 py38: parallel child exit code 1

dietlibc-0.33-alt3
	ar cru bin-i386/libcrypt.a dummy.o
	ar: dummy.o: No such file or directory
	make[1]: *** [Makefile:231: bin-i386/libcrypt.a] Error 1

firefox-esr-78.4.0-alt1
	22:25.83    Compiling gkrust v0.1.0
	(/usr/src/RPM/BUILD/firefox-78.4.0/mozilla/toolkit/library/rust)
	30:52.73     Finished release [optimized] target(s) in 27m 52s
	30:54.03 gmake[2]: *** [/usr/src/RPM/BUILD/firefox-78.4.0/mozilla/config/recurse.mk:34:
	compile] Error 2
	30:54.03 gmake[1]: *** [/usr/src/RPM/BUILD/firefox-78.4.0/mozilla/config/rules.mk:390:
	default] Error 2
	30:54.03 gmake: *** [client.mk:125: build] Error 2
	30:54.03 gmake: Leaving directory '/usr/src/RPM/BUILD/firefox-78.4.0/mozilla'
	30:54.03 78 compiler warnings present.
	Config object not found by mach.
	Configure complete!
	Be sure to run |mach build| to pick up any changes

glibc-6:2.30-alt2
	UNSUPPORTED: resolv/tst-resolv-threads
	FAIL: rt/tst-cpuclock2
	UNSUPPORTED: stdlib/tst-system
	--
	+ rc=2
	+ grep '^FAIL:' build-x86_64-linux/tests.sum
	+ cut '-d ' -f2-
	--
	==> build-x86_64-linux/rt/tst-cpuclock2.test-result <==
	FAIL: rt/tst-cpuclock2
	original exit status 1

openqa-4.5.1528009330.e68ebe2b-alt16
	./t/api/07-testsuites.t ..................................... ok
	#   Failed test 'specified schema not found'
	#   at ./t/api/08-jobtemplates.t line 695.
	--
	# Looks like you failed 1 test of 20.
	#   Failed test 'Schema handling'
	#   at ./t/api/08-jobtemplates.t line 701.
	--
	./t/api/08-jobtemplates.t				  (Wstat: 256 Tests: 66 Failed: 1)
	Failed test:  33
	Non-zero exit status: 1

python-module-nss-1.0.1-alt5
	In file included from src/py_nss.c:341:
	src/py_nss.h:126:3: error: conflicting types for 'RSAPublicKey'
	126 | } RSAPublicKey;
	--
	In file included from src/py_nss.c:341:
	src/py_nss.h:136:3: error: conflicting types for 'DSAPublicKey'
	136 | } DSAPublicKey;
	--
	323 | typedef struct DSAPublicKeyStr DSAPublicKey;
	error: command 'x86_64-alt-linux-gcc' failed with exit status 1

python3-module-nss-1.0.1-alt5
	In file included from src/py_nss.c:341:
	src/py_nss.h:126:3: error: conflicting types for ‘RSAPublicKey’
	126 | } RSAPublicKey;
	--
	In file included from src/py_nss.c:341:
	src/py_nss.h:136:3: error: conflicting types for ‘DSAPublicKey’
	136 | } DSAPublicKey;
	--
	24381 |     for (i = 0; i < sizeof(all_ciphers)/sizeof(all_ciphers[0]); i++) {
	error: command 'x86_64-alt-linux-gcc' failed with exit status 1

racket-7.3-alt2
	raco setup: 4 re-rendering: <pkgs>/racket-index/scribblings/main/release.scrbl
	raco setup: 3 re-rendering: <pkgs>/scribble-doc/scribblings/scribble/scribble.scrbl
	raco setup: 2 re-rendering: <pkgs>/racket-index/scribblings/main/start.scrbl
	raco setup: 1 re-rendering:
	<pkgs>/typed-racket-doc/typed-racket/scribblings/ts-reference.scrbl
	raco setup: 0 re-rendering: <pkgs>/racket-index/scribblings/main/local-redirect.scrbl
	raco setup: 4 re-rendering: <pkgs>/racket-index/scribblings/main/search.scrbl
	make[1]: *** [Makefile:196: install-3m] CPU time limit exceeded
	make[1]: Leaving directory '/usr/src/RPM/BUILD/racket-7.3/src'
	make: *** [Makefile:119: install] Error 2
	make: Leaving directory '/usr/src/RPM/BUILD/racket-7.3/src'

seamonkey-1:2.53.4-alt1
	1 warning generated.
	make[4]: Leaving directory '/usr/src/RPM/BUILD/seamonkey-2.53.4/objdir/js/src'
	make[4]: Entering directory '/usr/src/RPM/BUILD/seamonkey-2.53.4/objdir/js/src'
	libjs_src.a.desc
	rm -f libjs_src.a
	/usr/src/RPM/BUILD/seamonkey-2.53.4/objdir/_virtualenv/bin/python
	/usr/src/RPM/BUILD/seamonkey-2.53.4/mozilla/config/expandlibs_gen.py -o libjs_src.a.desc
	RegExp.o CTypes.o Library.o Parser.o StoreBuffer.o Disassembler-x86-shared.o jsarray.o
	jsatom.o jsdtoa.o jsmath.o jsutil.o pm_linux.o Interpreter.o Unified_cpp_js_src0.o
	Unified_cpp_js_src1.o Unified_cpp_js_src10.o Unified_cpp_js_src11.o Unified_cpp_js_src12.o
	Unified_cpp_js_src13.o Unified_cpp_js_src14.o Unified_cpp_js_src15.o Unified_cpp_js_src16.o
	Unified_cpp_js_src17.o Unified_cpp_js_src18.o Unified_cpp_js_src19.o Unified_cpp_js_src2.o
	Unified_cpp_js_src20.o Unified_cpp_js_src21.o Unified_cpp_js_src22.o Unified_cpp_js_src23.o
	Unified_cpp_js_src24.o Unified_cpp_js_src25.o Unified_cpp_js_src26.o Unified_cpp_js_src27.o
	Unified_cpp_js_src28.o Unified_cpp_js_src29.o Unified_cpp_js_src3.o Unified_cpp_js_src30.o
	Unified_cpp_js_src31.o Unified_cpp_js_src32.o Unified_cpp_js_src33.o Unified_cpp_js_src34.o
	Unified_cpp_js_src35.o Unified_cpp_js_src36.o Unified_cpp_js_src37.o Unified_cpp_js_src38.o
	Unified_cpp_js_src39.o Unified_cpp_js_src4.o Unified_cpp_js_src40.o Unified_cpp_js_src41.o
	Unified_cpp_js_src42.o Unified_cpp_js_src43.o Unified_cpp_js_src5.o Unified_cpp_js_src6.o
	Unified_cpp_js_src7.o Unified_cpp_js_src8.o Unified_cpp_js_src9.o
	make[4]: Leaving directory '/usr/src/RPM/BUILD/seamonkey-2.53.4/objdir/js/src'
	make[2]: *** [/usr/src/RPM/BUILD/seamonkey-2.53.4/mozilla/config/recurse.mk:33: compile]
	Error 2
	make[1]: *** [/usr/src/RPM/BUILD/seamonkey-2.53.4/mozilla/config/rules.mk:448: default]
	Error 2
	make: *** [client.mk:397: build] Error 2

telegram-desktop-2.3.1-alt1
	/usr/src/RPM/BUILD/telegram-desktop-2.3.1/Telegram/lib_storage/storage/cache/storage_cache_compactor.cpp:336:3:
	required from here
	/usr/src/RPM/BUILD/telegram-desktop-2.3.1/Telegram/lib_storage/storage/cache/storage_cache_compactor.cpp:335:31:
	error: no matching function for call to
	'Storage::Cache::details::CompactorObject::fillList(const
	std::vector<Storage::Cache::details::Store>&,
	Storage::Cache::details::CompactorObject::RawSpan&)'
	335 |	return fillList(list, values);

thunderbird-78.4.0-alt1
	29:29.59    Compiling gkrust v0.1.0
	(/usr/src/RPM/BUILD/thunderbird-78.4.0/toolkit/library/rust)
	37:42.80     Finished release [optimized] target(s) in 35m 34s
	37:44.09 gmake[2]: *** [/usr/src/RPM/BUILD/thunderbird-78.4.0/config/recurse.mk:34:
	compile] Error 2
	37:44.09 gmake[1]: *** [/usr/src/RPM/BUILD/thunderbird-78.4.0/config/rules.mk:390:
	default] Error 2
	37:44.09 gmake: *** [client.mk:125: build] Error 2
	37:44.09 gmake: Leaving directory '/usr/src/RPM/BUILD/thunderbird-78.4.0'
	37:44.11 183 compiler warnings present.
	error: Bad exit status from /usr/src/tmp/rpm-tmp.57011 (%build)
	RPM build errors:
	Unparseable macro: % for a library

transgui-5.18.0-alt2
	$0000rid.pas(1459,53) Заметка: (6058) Call to subroutine "operator :=(const
	source:WideString):Variant;" marked as inline is not inlined
	(1008) 1909 строк скомпилиpовано, 0.4 сек.
	(1022) 4 подсказок
	(1023) 19 заметок
	0000005BDA3B
	$00000000004047EB
	$00000000004041A3
	$0000000000402423
	$0000000000407B83
	$000000000040A799

	9 error logs REMOVED from the list
firefox-81.0.2-alt1
ghostscript-9.28-alt0.rc1.2
libopenh264-2.1.1-alt1
pacoxx-0.2.beta-alt6.1
perl-HTML-Widget-1.11-alt3
python3-3.8.6-alt1
qt5-webengine-5.15.1-alt1
thunderbird-78.3.3-alt1
zeal-0.6.1-alt1

Total 90 error logs.


Sisyphus-cybertalk