[cyber] I: Sisyphus-20201119 x86_64 beehive_status: +20 -6 (90)

ALT beekeeper hiver altlinux.org
19 10:04:28 MSK 2020


	20 NEW error logs

alltray-0.71b-alt2_14
	checking for PACKAGE... no
	configure: error: Package requirements (gtk+-2.0 >= 2.2.0 gdk-2.0 gconf-2.0
	gdk-pixbuf-xlib-2.0) were not met:
	No package 'gdk-pixbuf-xlib-2.0' found
	Consider adjusting the PKG_CONFIG_PATH environment variable if you

chromium-gost-86.0.4240.111-alt1
	warning: unknown warning option '-Wno-string-concatenation'; did you mean
	'-Wno-objc-string-concatenation'? [-Wunknown-warning-option]
	warning: unknown warning option '-Wno-max-tokens'; did you mean
	'-Wno-extra-tokens'? [-Wunknown-warning-option]
	3 warnings generated.
	[39502/43243] clang++ -MMD -MF
	obj/third_party/blink/renderer/core/html/html/html_frame_set_element.o.d
	-DUSE_UDEV -DUSE_AURA=1 -DUSE_GLIB=1 -DUSE_NSS_CERTS=1 -DUSE_X11=1 -DOFFICIAL_BUILD
	-D_FILE_OFFSET_BITS=64 -D_LARGEFILE_SOURCE -D_LARGEFILE64_SOURCE -DNO_UNWIND_TABLES
	-D_GNU_SOURCE -D__STDC_CONSTANT_MACROS -D__STDC_FORMAT_MACROS -D_FORTIFY_SOURCE=2
	-DNDEBUG -DNVALGRIND -DDYNAMIC_ANNOTATIONS_ENABLED=0 -DBLINK_CORE_IMPLEMENTATION=1
	-DGLIB_VERSION_MAX_ALLOWED=GLIB_VERSION_2_40 -DGLIB_VERSION_MIN_REQUIRED=GLIB_VERSION_2_40
	-DWEBP_EXTERN=extern -DVK_USE_PLATFORM_XCB_KHR -DGL_GLEXT_PROTOTYPES -DUSE_GLX
	-DUSE_EGL -DBLINK_IMPLEMENTATION=1 -DINSIDE_BLINK -DU_USING_ICU_NAMESPACE=0
	-DU_ENABLE_DYLOAD=0 -DUSE_CHROMIUM_ICU=1 -DU_ENABLE_TRACING=1 -DU_ENABLE_RESOURCE_TRACING=0
	-DU_STATIC_IMPLEMENTATION -DICU_UTIL_DATA_IMPL=ICU_UTIL_DATA_FILE -DUCHAR_TYPE=uint16_t
	-DWEBRTC_NON_STATIC_TRACE_EVENT_HANDLERS=0 -DWEBRTC_CHROMIUM_BUILD -DWEBRTC_POSIX
	-DWEBRTC_LINUX -DABSL_ALLOCATOR_NOTHROW=1 -DWEBRTC_USE_BUILTIN_ISAC_FIX=0
	-DWEBRTC_USE_BUILTIN_ISAC_FLOAT=1 -DWEBRTC_USE_X11 -DHAVE_SCTP -DNO_MAIN_THREAD_WRAPPING
	-DGOOGLE_PROTOBUF_NO_RTTI -DGOOGLE_PROTOBUF_NO_STATIC_INITIALIZER
	-DHAVE_PTHREAD -DSK_CODEC_DECODES_PNG -DSK_CODEC_DECODES_WEBP -DSK_ENCODE_PNG
	-DSK_ENCODE_WEBP -DSK_USER_CONFIG_HEADER=\"../../skia/config/SkUserConfig.h\"
	-DSK_GL -DSK_CODEC_DECODES_JPEG -DSK_ENCODE_JPEG -DSK_USE_LIBGIFCODEC
	-DSK_VULKAN_HEADER=\"../../skia/config/SkVulkanConfig.h\" -DSK_VULKAN=1 -DSK_SUPPORT_GPU=1
	-DSK_GPU_WORKAROUNDS_HEADER=\"gpu/config/gpu_driver_bug_workaround_autogen.h\"
	-DVK_USE_PLATFORM_XCB_KHR -DV8_COMPRESS_POINTERS -DV8_31BIT_SMIS_ON_64BIT_ARCH
	-DV8_DEPRECATION_WARNINGS -DCRASHPAD_ZLIB_SOURCE_EXTERNAL -DLEVELDB_PLATFORM_CHROMIUM=1
	-DLEVELDB_PLATFORM_CHROMIUM=1 -DSUPPORT_WEBGL2_COMPUTE_CONTEXT=1 -DWTF_USE_WEBAUDIO_PFFFT=1
	-DUSE_BLINK_V8_BINDING_NEW_IDL_INTERFACE -DUSE_LIBJPEG_TURBO=1 -DV8_COMPRESS_POINTERS
	-DV8_31BIT_SMIS_ON_64BIT_ARCH -DV8_DEPRECATION_WARNINGS -DLIBXSLT_STATIC -I../.. -Igen
	-I../../third_party/perfetto/include -Igen/third_party/perfetto/build_config
	-Igen/third_party/perfetto -I../../third_party/libyuv/include
	-I../../third_party/jsoncpp/source/include -I../../third_party/jsoncpp/generated
	-Igen/shim_headers/opus_shim -Igen/shim_headers/ffmpeg_shim -I../../third_party/libwebp/src
	-I../../third_party/vulkan_headers/include -I../../third_party/khronos -I../../gpu
	-Igen/third_party/dawn/src/include -I../../third_party/dawn/src/include
	-I../../third_party/abseil-cpp -I../../third_party/boringssl/src/include
	-I../../third_party/protobuf/src -Igen/protoc_out -I../../third_party/ced/src
	-I../../third_party/icu/source/common -I../../third_party/icu/source/i18n
	-I../../third_party/webrtc_overrides -I../../third_party/webrtc -Igen/third_party/webrtc
	-I../../third_party/protobuf/src -I../../third_party/skia -I../../third_party/libgifcodec
	-I../../third_party/vulkan/include -I../../third_party/vulkan_headers/include
	-I../../third_party/angle/include -I../../third_party/angle/src/common/third_party/base
	-Igen/angle -I../../third_party/angle/include -I../../v8/include -Igen/v8/include
	-I../../third_party/crashpad/crashpad -I../../third_party/crashpad/crashpad/compat/non_mac
	-I../../third_party/crashpad/crashpad/compat/linux
	-I../../third_party/crashpad/crashpad/compat/non_win -I../../third_party/zlib
	-I../../third_party/libwebm/source -I../../third_party/leveldatabase
	-I../../third_party/leveldatabase/src -I../../third_party/leveldatabase/src/include
	-I../../third_party/mesa_headers -I../../third_party/libjpeg_turbo
	-I../../third_party/iccjpeg -I../../third_party/libpng -I../../third_party/ots/include
	-I../../v8/include -Igen/v8/include -I../../third_party/libxml/src/include
	-I../../third_party/libxml/linux/include -I../../third_party/libxslt/src
	-I../../third_party/snappy/src -I../../third_party/snappy/linux
	-fprofile-sample-use=../../chrome/android/profiles/afdo.prof -fno-strict-aliasing
	--param=ssp-buffer-size=4 -fstack-protector -fno-unwind-tables
	-fno-asynchronous-unwind-tables -fPIC -pthread -fcolor-diagnostics -fmerge-all-constants -f
	warning: unknown warning option '-Wno-psabi' [-Wunknown-warning-option]
	warning: unknown warning option '-Wno-string-concatenation'; did you mean
	'-Wno-objc-string-concatenation'? [-Wunknown-warning-option]
	warning: unknown warning option '-Wno-max-tokens'; did you mean
	'-Wno-extra-tokens'? [-Wunknown-warning-option]
	3 warnings generated.
	[39503/43243] clang++ -MMD -MF
	obj/third_party/blink/renderer/core/html/html/html_frame_owner_element.o.d
	-DUSE_UDEV -DUSE_AURA=1 -DUSE_GLIB=1 -DUSE_NSS_CERTS=1 -DUSE_X11=1 -DOFFICIAL_BUILD
	-D_FILE_OFFSET_BITS=64 -D_LARGEFILE_SOURCE -D_LARGEFILE64_SOURCE -DNO_UNWIND_TABLES
	-D_GNU_SOURCE -D__STDC_CONSTANT_MACROS -D__STDC_FORMAT_MACROS -D_FORTIFY_SOURCE=2
	-DNDEBUG -DNVALGRIND -DDYNAMIC_ANNOTATIONS_ENABLED=0 -DBLINK_CORE_IMPLEMENTATION=1
	-DGLIB_VERSION_MAX_ALLOWED=GLIB_VERSION_2_40 -DGLIB_VERSION_MIN_REQUIRED=GLIB_VERSION_2_40
	-DWEBP_EXTERN=extern -DVK_USE_PLATFORM_XCB_KHR -DGL_GLEXT_PROTOTYPES -DUSE_GLX
	-DUSE_EGL -DBLINK_IMPLEMENTATION=1 -DINSIDE_BLINK -DU_USING_ICU_NAMESPACE=0
	-DU_ENABLE_DYLOAD=0 -DUSE_CHROMIUM_ICU=1 -DU_ENABLE_TRACING=1 -DU_ENABLE_RESOURCE_TRACING=0
	-DU_STATIC_IMPLEMENTATION -DICU_UTIL_DATA_IMPL=ICU_UTIL_DATA_FILE -DUCHAR_TYPE=uint16_t
	-DWEBRTC_NON_STATIC_TRACE_EVENT_HANDLERS=0 -DWEBRTC_CHROMIUM_BUILD -DWEBRTC_POSIX
	-DWEBRTC_LINUX -DABSL_ALLOCATOR_NOTHROW=1 -DWEBRTC_USE_BUILTIN_ISAC_FIX=0
	-DWEBRTC_USE_BUILTIN_ISAC_FLOAT=1 -DWEBRTC_USE_X11 -DHAVE_SCTP -DNO_MAIN_THREAD_WRAPPING
	-DGOOGLE_PROTOBUF_NO_RTTI -DGOOGLE_PROTOBUF_NO_STATIC_INITIALIZER
	-DHAVE_PTHREAD -DSK_CODEC_DECODES_PNG -DSK_CODEC_DECODES_WEBP -DSK_ENCODE_PNG
	-DSK_ENCODE_WEBP -DSK_USER_CONFIG_HEADER=\"../../skia/config/SkUserConfig.h\"
	-DSK_GL -DSK_CODEC_DECODES_JPEG -DSK_ENCODE_JPEG -DSK_USE_LIBGIFCODEC
	-DSK_VULKAN_HEADER=\"../../skia/config/SkVulkanConfig.h\" -DSK_VULKAN=1 -DSK_SUPPORT_GPU=1
	-DSK_GPU_WORKAROUNDS_HEADER=\"gpu/config/gpu_driver_bug_workaround_autogen.h\"
	-DVK_USE_PLATFORM_XCB_KHR -DV8_COMPRESS_POINTERS -DV8_31BIT_SMIS_ON_64BIT_ARCH
	-DV8_DEPRECATION_WARNINGS -DCRASHPAD_ZLIB_SOURCE_EXTERNAL -DLEVELDB_PLATFORM_CHROMIUM=1
	-DLEVELDB_PLATFORM_CHROMIUM=1 -DSUPPORT_WEBGL2_COMPUTE_CONTEXT=1 -DWTF_USE_WEBAUDIO_PFFFT=1
	-DUSE_BLINK_V8_BINDING_NEW_IDL_INTERFACE -DUSE_LIBJPEG_TURBO=1 -DV8_COMPRESS_POINTERS
	-DV8_31BIT_SMIS_ON_64BIT_ARCH -DV8_DEPRECATION_WARNINGS -DLIBXSLT_STATIC -I../.. -Igen
	-I../../third_party/perfetto/include -Igen/third_party/perfetto/build_config
	-Igen/third_party/perfetto -I../../third_party/libyuv/include
	-I../../third_party/jsoncpp/source/include -I../../third_party/jsoncpp/generated
	-Igen/shim_headers/opus_shim -Igen/shim_headers/ffmpeg_shim -I../../third_party/libwebp/src
	-I../../third_party/vulkan_headers/include -I../../third_party/khronos -I../../gpu
	-Igen/third_party/dawn/src/include -I../../third_party/dawn/src/include
	-I../../third_party/abseil-cpp -I../../third_party/boringssl/src/include
	-I../../third_party/protobuf/src -Igen/protoc_out -I../../third_party/ced/src
	-I../../third_party/icu/source/common -I../../third_party/icu/source/i18n
	-I../../third_party/webrtc_overrides -I../../third_party/webrtc -Igen/third_party/webrtc
	-I../../third_party/protobuf/src -I../../third_party/skia -I../../third_party/libgifcodec
	-I../../third_party/vulkan/include -I../../third_party/vulkan_headers/include
	-I../../third_party/angle/include -I../../third_party/angle/src/common/third_party/base
	-Igen/angle -I../../third_party/angle/include -I../../v8/include -Igen/v8/include
	-I../../third_party/crashpad/crashpad -I../../third_party/crashpad/crashpad/compat/non_mac
	-I../../third_party/crashpad/crashpad/compat/linux
	-I../../third_party/crashpad/crashpad/compat/non_win -I../../third_party/zlib
	-I../../third_party/libwebm/source -I../../third_party/leveldatabase
	-I../../third_party/leveldatabase/src -I../../third_party/leveldatabase/src/include
	-I../../third_party/mesa_headers -I../../third_party/libjpeg_turbo
	-I../../third_party/iccjpeg -I../../third_party/libpng -I../../third_party/ots/include
	-I../../v8/include -Igen/v8/include -I../../third_party/libxml/src/include
	-I../../third_party/libxml/linux/include -I../../third_party/libxslt/src
	-I../../third_party/snappy/src -I../../third_party/snappy/linux
	-fprofile-sample-use=../../chrome/android/profiles/afdo.prof -fno-strict-aliasing
	--param=ssp-buffer-size=4 -fstack-protector -fno-unwind-tables
	-fno-asynchronous-unwind-tables -fPIC -pthread -fcolor-diagnostics -fmerge-all-constants
	hasher-priv: master: time elapsed limit (25000 seconds) exceeded

clisp-1:2.49.92-alt2
	Bye.
	(echo *.erg | grep '*' >/dev/null) || (echo "Test failed:" ; ls -l *erg; echo "To see
	which tests failed, type" ; echo "    cat "`pwd`"/*.erg" ; exit 1)
	Test failed:
	-rw-r--r-- 1 builder builder 848 Nov 19 05:40 socket.erg
	To see which tests failed, type
	cat /usr/src/RPM/BUILD/clisp-2.49.92/src/tests/*.erg

deepin-api-5.3.0.12-alt1
	# pkg-config --cflags  -- gdk-pixbuf-2.0 gdk-3.0 gdk-pixbuf-xlib-2.0 gdk-x11-3.0 x11
	Package gdk-pixbuf-xlib-2.0 was not found in the pkg-config search path.
	Perhaps you should add the directory containing `gdk-pixbuf-xlib-2.0.pc'
	to the PKG_CONFIG_PATH environment variable
	No package 'gdk-pixbuf-xlib-2.0' found
	pkg-config: exit status 1

deepin-daemon-1:5.11.0.36-alt4
	# pkg-config --cflags  -- gdk-pixbuf-2.0 gdk-3.0 gdk-pixbuf-xlib-2.0 gdk-x11-3.0 x11
	Package gdk-pixbuf-xlib-2.0 was not found in the pkg-config search path.
	Perhaps you should add the directory containing `gdk-pixbuf-xlib-2.0.pc'
	to the PKG_CONFIG_PATH environment variable
	No package 'gdk-pixbuf-xlib-2.0' found
	pkg-config: exit status 1

gear-2.3.0-alt1
	tests passed:	  356  99%
	tests failed:	    1	0%
	tests skipped:	    0	0%

handbrake-1.3.1-alt3
	make[1]: Entering directory
	'/usr/src/RPM/BUILD/HandBrake-1.3.1/build/contrib/nvenc/nv-codec-headers-n9.0.18.1'
	make[1]: *** No rule to make target 'clean'.  Stop.
	make[1]: Leaving directory
	'/usr/src/RPM/BUILD/HandBrake-1.3.1/build/contrib/nvenc/nv-codec-headers-n9.0.18.1'
	--
	set -e; /bin/mkdir -p ./contrib/ffmpeg/ffmpeg-4.2.2/; cd ./contrib/ffmpeg/ffmpeg-4.2.2/;
	CC=/usr/bin/gcc CFLAGS="-I/usr/src/RPM/BUILD/HandBrake-1.3.1/build/contrib/include
	-std=gnu99 -pipe -frecord-gcc-switches -Wall -g -O2 -mfpmath=sse -msse2"
	CXX=/usr/bin/g++ CXXFLAGS="-I/usr/src/RPM/BUILD/HandBrake-1.3.1/build/contrib/include
	-pipe -frecord-gcc-switches -Wall -g -O2 -mfpmath=sse -msse2"
	CPPFLAGS="-I/usr/src/RPM/BUILD/HandBrake-1.3.1/build/contrib/include
	" LDFLAGS="-L/usr/src/RPM/BUILD/HandBrake-1.3.1/build/contrib/lib "
	PKG_CONFIG_PATH="/usr/src/RPM/BUILD/HandBrake-1.3.1/build/contrib/lib/pkgconfig"
	PATH="/usr/src/RPM/BUILD/HandBrake-1.3.1/build/contrib/bin:/usr/src/bin:/bin:/usr/bin:/usr/X11R6/bin:/usr/games"
	./configure --prefix=/usr/src/RPM/BUILD/HandBrake-1.3.1/build/contrib/ --disable-shared
	--enable-static --enable-gpl --disable-doc --disable-programs --disable-avdevice
	--disable-muxers --disable-network --disable-hwaccels --disable-vdpau --disable-encoders
	--enable-libmp3lame --enable-encoder=aac --enable-encoder=ac3 --enable-encoder=eac3
	--enable-encoder=flac --enable-encoder=mpeg2video --enable-encoder=mpeg4
	--enable-encoder=libmp3lame --enable-libopus --enable-encoder=libopus
	--enable-libspeex --disable-encoder=libspeex --enable-decoder=libspeex --enable-libvpx
	--disable-decoder=libvpx_* --enable-encoder=libvpx_vp8 --enable-encoder=libvpx_vp9
	--disable-decoder=*_crystalhd --enable-libdav1d --enable-decoder=libdav1d
	--cc="/usr/bin/gcc" --extra-ldflags="-pipe -frecord-gcc-switches -Wall -g -O2 -mfpmath=sse
	-msse2 -L/usr/src/RPM/BUILD/HandBrake-1.3.1/build/contrib/lib" --disable-vaapi
	--enable-nonfree --enable-libfdk-aac --enable-encoder=libfdk_aac --enable-muxer=matroska
	--enable-muxer=webm --enable-muxer=mov --enable-muxer=mp4 --enable-muxer=psp
	--enable-muxer=ipod --disable-debug --extra-cflags="-pipe -frecord-gcc-switches -Wall
	-g -O2 -mfpmath=sse -msse2 -I/usr/src/RPM/BUILD/HandBrake-1.3.1/build/contrib/include
	-DNDEBUG" --enable-nvenc --enable-encoder=h264_nvenc --enable-encoder=hevc_nvenc
	ERROR: dav1d >= 0.2.1 not found using pkg-config
	If you think configure made a mistake, make sure you are using the latest

icewm-3:1.9.2-alt1
	--   Found fontconfig, version 2.13.1
	Package bzip2 was not found in the pkg-config search path.
	Perhaps you should add the directory containing `bzip2.pc'
	to the PKG_CONFIG_PATH environment variable
	Package 'bzip2', required by 'freetype2', not found
	Package bzip2 was not found in the pkg-config search path.
	Perhaps you should add the directory containing `bzip2.pc'
	to the PKG_CONFIG_PATH environment variable
	Package 'bzip2', required by 'freetype2', not found
	Package bzip2 was not found in the pkg-config search path.
	Perhaps you should add the directory containing `bzip2.pc'
	to the PKG_CONFIG_PATH environment variable
	Package 'bzip2', required by 'freetype2', not found
	Package bzip2 was not found in the pkg-config search path.
	Perhaps you should add the directory containing `bzip2.pc'
	to the PKG_CONFIG_PATH environment variable
	Package 'bzip2', required by 'freetype2', not found
	-- Checking for module 'xrender'
	--   Found xrender, version 0.9.10
	Package xdmcp was not found in the pkg-config search path.
	Perhaps you should add the directory containing `xdmcp.pc'
	to the PKG_CONFIG_PATH environment variable
	Package 'xdmcp', required by 'xcb', not found
	Package xdmcp was not found in the pkg-config search path.

iputils-20200821-alt2
	[10/38] cc -Iping/ping.p -Iping -I../ping -I. -I.. -fdiagnostics-color=always
	-pipe -D_FILE_OFFSET_BITS=64 -Wall -Winvalid-pch -Wextra -Wpedantic -std=c99
	-include config.h -include git-version.h -DUSE_IDN -frecord-gcc-switches -Wall -g -O2
	-fno-strict-aliasing -Wstrict-prototypes -Werror -fpie -MD -MQ ping/ping.p/.._modcap.c.o
	-MF ping/ping.p/.._modcap.c.o.d -o ping/ping.p/.._modcap.c.o -c ../modcap.c
	FAILED: ping/ping.p/.._modcap.c.o
	cc -Iping/ping.p -Iping -I../ping -I. -I.. -fdiagnostics-color=always -pipe
	-D_FILE_OFFSET_BITS=64 -Wall -Winvalid-pch -Wextra -Wpedantic -std=c99 -include
	config.h -include git-version.h -DUSE_IDN -frecord-gcc-switches -Wall -g -O2
	-fno-strict-aliasing -Wstrict-prototypes -Werror -fpie -MD -MQ ping/ping.p/.._modcap.c.o
	-MF ping/ping.p/.._modcap.c.o.d -o ping/ping.p/.._modcap.c.o -c ../modcap.c
	../modcap.c:13:29: error: ISO C does not permit named variadic macros
	[-Werror=variadic-macros]
	13 | #define FAIL_EXIT(fstr, args...) error (EXIT_FAILURE, errno, fstr, ##args)
	../modcap.c: In function ‘modify_capability_common’:
	../modcap.c:22:27: error: ISO C99 requires at least one argument for the "..." in a
	variadic macro [-Werror]
	22 |   FAIL_EXIT("cap_get_proc");
	../modcap.c:27:27: error: ISO C99 requires at least one argument for the "..." in a
	variadic macro [-Werror]
	27 |   FAIL_EXIT("cap_get_flag");
	../modcap.c:36:27: error: ISO C99 requires at least one argument for the "..." in a
	variadic macro [-Werror]
	36 |   FAIL_EXIT("cap_set_flag");
	../modcap.c:40:27: error: ISO C99 requires at least one argument for the "..." in a
	variadic macro [-Werror]
	40 |   FAIL_EXIT("cap_set_proc");
	../modcap.c: In function ‘limit_capabilities_common’:
	../modcap.c:62:23: error: ISO C99 requires at least one argument for the "..." in a
	variadic macro [-Werror]
	62 |   FAIL_EXIT("cap_init");
	../modcap.c:82:26: error: ISO C99 requires at least one argument for the "..." in a
	variadic macro [-Werror]
	82 |	FAIL_EXIT("initgroups");
	../modcap.c:88:37: error: ISO C99 requires at least one argument for the "..." in a
	variadic macro [-Werror]
	88 |	FAIL_EXIT("chdir to \"/\" failed");
	../modcap.c:92:28: error: ISO C99 requires at least one argument for the "..." in a
	variadic macro [-Werror]
	92 |	FAIL_EXIT("cap_set_flag");

jed-2:0.99.19-alt2.qa2.1
	/usr/bin/ld.default: sysdep.o: file not recognized: file truncated
	collect2: error: ld returned 1 exit status
	make[1]: *** [Makefile:157: /usr/src/RPM/BUILD/jed-0.99-19/src/objs/jed] Error 1

libgupnp-igd-1.2.0-alt1
	Full log written to
	/usr/src/RPM/BUILD/gupnp-igd-1.2.0/x86_64-alt-linux/meson-logs/testlog.txt
	FAILED: meson-test
	/usr/bin/meson test --no-rebuild --print-errorlogs

libopencv-1:4.5.0-alt1
	make[2]: Entering directory '/usr/src/RPM/BUILD/libopencv-4.5.0/BUILD'
	[ 14%] Linking CXX shared library ../../lib/libopencv_imgproc.so
	cd /usr/src/RPM/BUILD/libopencv-4.5.0/BUILD/modules/imgproc && /usr/bin/cmake -E
	cmake_link_script CMakeFiles/opencv_imgproc.dir/link.txt --verbose=1
	/usr/bin/c++ -fPIC -pipe -frecord-gcc-switches -Wall -g -O2   -fsigned-char -W -Wall
	-Werror=return-type -Werror=non-virtual-dtor -Werror=address -Werror=sequence-point
	-Wformat -Werror=format-security -Wmissing-declarations -Wundef -Winit-self
	-Wpointer-arith -Wshadow -Wsign-promo -Wuninitialized -Winit-self -Wsuggest-override
	-Wno-delete-non-virtual-dtor -Wno-comment -Wimplicit-fallthrough=3 -Wno-strict-overflow
	-fdiagnostics-show-option -Wno-long-long -pthread -fomit-frame-pointer -ffunction-sections
	-fdata-sections  -msse -msse2 -msse3 -fvisibility=hidden -fvisibility-inlines-hidden -O2 -g
	-DNDEBUG   -Wl,--gc-sections -Wl,--as-needed -shared -Wl,-soname,libopencv_imgproc.so.4.5
	-o ../../lib/libopencv_imgproc.so.4.5.0 CMakeFiles/opencv_imgproc.dir/src/accum.cpp.o
	CMakeFiles/opencv_imgproc.dir/src/accum.dispatch.cpp.o
	CMakeFiles/opencv_imgproc.dir/src/approx.cpp.o
	CMakeFiles/opencv_imgproc.dir/src/bilateral_filter.dispatch.cpp.o
	CMakeFiles/opencv_imgproc.dir/src/blend.cpp.o
	CMakeFiles/opencv_imgproc.dir/src/box_filter.dispatch.cpp.o
	CMakeFiles/opencv_imgproc.dir/src/canny.cpp.o CMakeFiles/opencv_imgproc.dir/src/clahe.cpp.o
	CMakeFiles/opencv_imgproc.dir/src/color.cpp.o
	CMakeFiles/opencv_imgproc.dir/src/color_hsv.dispatch.cpp.o
	CMakeFiles/opencv_imgproc.dir/src/color_lab.cpp.o
	CMakeFiles/opencv_imgproc.dir/src/color_rgb.dispatch.cpp.o
	CMakeFiles/opencv_imgproc.dir/src/color_yuv.dispatch.cpp.o
	CMakeFiles/opencv_imgproc.dir/src/colormap.cpp.o
	CMakeFiles/opencv_imgproc.dir/src/connectedcomponents.cpp.o
	CMakeFiles/opencv_imgproc.dir/src/contours.cpp.o
	CMakeFiles/opencv_imgproc.dir/src/convhull.cpp.o
	CMakeFiles/opencv_imgproc.dir/src/corner.cpp.o
	CMakeFiles/opencv_imgproc.dir/src/cornersubpix.cpp.o
	CMakeFiles/opencv_imgproc.dir/src/demosaicing.cpp.o
	CMakeFiles/opencv_imgproc.dir/src/deriv.cpp.o
	CMakeFiles/opencv_imgproc.dir/src/distransform.cpp.o
	CMakeFiles/opencv_imgproc.dir/src/drawing.cpp.o CMakeFiles/opencv_imgproc.dir/src/emd.cpp.o
	CMakeFiles/opencv_imgproc.dir/src/featureselect.cpp.o
	CMakeFiles/opencv_imgproc.dir/src/filter.dispatch.cpp.o
	CMakeFiles/opencv_imgproc.dir/src/floodfill.cpp.o
	CMakeFiles/opencv_imgproc.dir/src/gabor.cpp.o
	CMakeFiles/opencv_imgproc.dir/src/generalized_hough.cpp.o
	CMakeFiles/opencv_imgproc.dir/src/geometry.cpp.o
	CMakeFiles/opencv_imgproc.dir/src/grabcut.cpp.o
	CMakeFiles/opencv_imgproc.dir/src/hershey_fonts.cpp.o
	CMakeFiles/opencv_imgproc.dir/src/histogram.cpp.o
	CMakeFiles/opencv_imgproc.dir/src/hough.cpp.o
	CMakeFiles/opencv_imgproc.dir/src/imgwarp.cpp.o
	CMakeFiles/opencv_imgproc.dir/src/intersection.cpp.o
	CMakeFiles/opencv_imgproc.dir/src/linefit.cpp.o CMakeFiles/opencv_imgproc.dir/src/lsd.cpp.o
	CMakeFiles/opencv_imgproc.dir/src/main.cpp.o
	CMakeFiles/opencv_imgproc.dir/src/matchcontours.cpp.o
	CMakeFiles/opencv_imgproc.dir/src/median_blur.dispatch.cpp.o
	CMakeFiles/opencv_imgproc.dir/src/min_enclosing_triangle.cpp.o
	CMakeFiles/opencv_imgproc.dir/src/moments.cpp.o
	CMakeFiles/opencv_imgproc.dir/src/morph.dispatch.cpp.o
	CMakeFiles/opencv_imgproc.dir/src/phasecorr.cpp.o
	CMakeFiles/opencv_imgproc.dir/src/pyramids.cpp.o
	CMakeFiles/opencv_imgproc.dir/src/resize.cpp.o
	CMakeFiles/opencv_imgproc.dir/src/rotcalipers.cpp.o
	CMakeFiles/opencv_imgproc.dir/src/samplers.cpp.o
	CMakeFiles/opencv_imgproc.dir/src/segmentation.cpp.o
	CMakeFiles/opencv_imgproc.dir/src/shapedescr.cpp.o
	CMakeFiles/opencv_imgproc.dir/src/smooth.dispatch.cpp.o
	CMakeFiles/opencv_imgproc.dir/src/spatialgradient.cpp.o
	CMakeFiles/opencv_imgproc.dir/src/subdivision2d.cpp.o
	CMakeFiles/opencv_imgproc.dir/src/sumpixels.dispatch.cpp.o
	CMakeFiles/opencv_imgproc.dir/src/tables.cpp.o
	CMakeFiles/opencv_imgproc.dir/src/templmatch.cpp.o
	CMakeFiles/opencv_imgproc.dir/src/thresh.cpp.o
	CMakeFiles/opencv_imgproc.dir/src/utils.cpp.o
	CMakeFiles/opencv_imgproc.dir/opencl_kernels_imgproc.cpp.o
	CMakeFiles/opencv_imgproc.dir/src/imgwarp.sse4_1.cpp.o
	CMakeFiles/opencv_imgproc.dir/src/resize.sse4_1.cpp.o
	CMakeFiles/opencv_imgproc.dir/accum.sse4_1.cpp.o
	CMakeFiles/opencv_imgproc.dir/box_filter.sse4_1.cpp.o
	CMakeFiles/opencv_imgproc.dir/filter.sse4_1.cpp.o CMakeFiles/o
	cd /usr/src/RPM/BUILD/libopencv-4.5.0/BUILD/modules/imgproc &&
	/usr/bin/cmake -E cmake_symlink_library ../../lib/libopencv_imgproc.so.4.5.0
	../../lib/libopencv_imgproc.so.4.5 ../../lib/libopencv_imgproc.so
	make[2]: Leaving directory '/usr/src/RPM/BUILD/libopencv-4.5.0/BUILD'
	make[1]: Entering directory '/usr/src/RPM/BUILD/libopencv-4.5.0/BUILD'
	[ 14%] Built target opencv_imgproc
	make[1]: Leaving directory '/usr/src/RPM/BUILD/libopencv-4.5.0/BUILD'
	make: *** [Makefile:185: all] Error 2

lxde-lxpanel-0.10.0-alt1
	547 | struct _GTimeVal
	task-button.c:46:10: fatal error: gdk-pixbuf-xlib/gdk-pixbuf-xlib.h: No such file
	or directory
	46 | #include <gdk-pixbuf-xlib/gdk-pixbuf-xlib.h>

open-vm-tools-11.2.0-alt1
	checking for gdk-pixbuf-xlib-2.0 >= 2.21.0 (via pkg-config)... no
	configure: error: gdk-pixbuf-xlib-2.0 not found. Please configure without X11 (using
	--without-x) or install the gdk-pixbuf-xlib-2.0 devel package.

pdfmod-0.9.1-alt9
	checking for mcs... no
	configure: error: mcs Not found

sawfish-1.12.90-alt2
	autoreconf-default: running: aclocal --force
	aclocal-default: warning: couldn't open directory 'm4': No such file or directory
	autoreconf-default: configure.ac: tracing
	--
	... no
	configure: error: cannot locate gdk-pixbuf-xlib-2.0 >= 2.24.0
	error: Bad exit status from /usr/src/tmp/rpm-tmp.45538 (%build)

transgui-5.18.0-alt2
	$00000000005BDA3B
	$rid.pas(1459,53) Заметка: (6058) Call to subroutine "operator :=(const
	source:WideString):Variant;" marked as inline is not inlined
	(1008) 1909 строк скомпилиpовано, 0.4 сек.
	(1022) 4 подсказок
	(1023) 19 заметок
	00000000004047EB
	$00000000004041A3
	$0000000000402423
	$0000000000407B83
	$000000000040A799

w3m-0.5.3-alt3.git20200502
	x86_64-alt-linux-gcc  -I../.. -I../.. -I. -pipe -frecord-gcc-switches -Wall -g -O2
	-I/usr/include/gc -I./libwc   -I/usr/include/gc -DHAVE_CONFIG_H  -c x11_w3mimg.c
	x11_w3mimg.c:16:10: fatal error: glib-object.h: No such file or directory
	16 | #include <glib-object.h>

xqf-1.0.6.2-alt2
	checking for gtk+-2.0 >= 2.0.0 gdk-pixbuf-xlib-2.0 x11... no
	configure: error: Package requirements (gtk+-2.0 >= 2.0.0 gdk-pixbuf-xlib-2.0 x11)
	were not met:
	No package 'gdk-pixbuf-xlib-2.0' found
	Consider adjusting the PKG_CONFIG_PATH environment variable if you

xscreensaver-5.44-alt1
	Processing files: xscreensaver-5.44-alt1
	error: No such file or directory:
	/usr/src/tmp/xscreensaver-buildroot/usr/share/xscreensaver/glade
	Executing(%doc): /bin/sh -e /usr/src/tmp/rpm-tmp.36504
	--
	RPM build errors:
	No such file or directory: /usr/src/tmp/xscreensaver-buildroot/usr/share/xscreensaver/glade

	6 error logs REMOVED from the list
gnutls30-3.6.15-alt1
kiwix-lib-9.4.0-alt1
mysql-workbench-community-8.0.20-alt3
quilt-0.66-alt1
stress-ng-0.11.23-alt1
telepathy-salut-0.8.1-alt3

Total 90 error logs.


Sisyphus-cybertalk