[cyber] I: Sisyphus-20201116 x86_64 beehive_status: +10 -9 (100)

ALT beekeeper hiver altlinux.org
16 09:50:21 MSK 2020


	10 NEW error logs

dietlibc-0.33-alt3
	ar cru bin-x32/libcrypt.a dummy.o
	ar: dummy.o: No such file or directory
	make[1]: *** [Makefile:231: bin-x32/libcrypt.a] Error 1

erlang-proper-1.3-alt2
	DEBUG: No processes to kill
	ERROR: One or more eunit tests failed.
	ERROR: eunit failed while processing /usr/src/RPM/BUILD/erlang-proper-1.3: rebar_abort

fish-3.1.2-alt1
	[100%] Building HTML documentation with Sphinx
	Theme error:
	An error happened in rendering the page cmds/alias.

kernel-modules-ipt-so-std-def-1.0-alt7.328779.1
	Selected version kernel-image-std-def#2:5.4.75-alt1:sisyphus+261117.100.1.2  1604681104
	for kernel-image-std-def=2:5.4.75-alt1
	E: Couldn't find package rpm-build-kernel-perms
	hsh-install: Failed to calculate package file list.

libopenh264-2.1.1-alt1
	--- stderr ---
	[OpenH264] this = 0x0x173dc60, Error:Don't support width(9) or height(11) which is less
	than 16!
	[OpenH264] this = 0x0x173dc60, Error:CWelsH264SVCEncoder::EncodeFrame(), kiEncoderReturn 5
	Full log written to
	/usr/src/RPM/BUILD/openh264-2.1.1/x86_64-alt-linux/meson-logs/testlog.txt
	FAILED: meson-test
	/usr/bin/meson test --no-rebuild --print-errorlogs

libopenshot-0.2.5-alt1
	RUNNING ALL TESTS
	/usr/src/RPM/BUILD/libopenshot-0.2.5/tests/ImageWriter_Tests.cpp:80:1: error: Failure
	in ImageWriter_Test_Gif: Expected 20 +/- 5 but was 0
	/usr/src/RPM/BUILD/libopenshot-0.2.5/tests/ImageWriter_Tests.cpp:81:1: error: Failure
	in ImageWriter_Test_Gif: Expected 18 +/- 5 but was 0
	/usr/src/RPM/BUILD/libopenshot-0.2.5/tests/ImageWriter_Tests.cpp:82:1: error: Failure
	in ImageWriter_Test_Gif: Expected 11 +/- 5 but was 0
	[libvpx @ 0x1750d80] v1.9.0
	--
	libpng warning: iCCP: known incorrect sRGB profile
	FAILURE: 1 out of 93 tests failed (3 failures).
	Test time: 20.14 seconds.

python3-3.8.6-alt1
	1 test failed:
	test_signal
	20 tests skipped:
	test_curses test_devpoll test_ioctl test_kqueue test_msilib
	test_ossaudiodev test_smtpnet test_socketserver test_startfile
	test_timeout test_tix test_tk test_ttk_guionly test_urllib2net
	test_urllibnet test_winconsoleio test_winreg test_winsound
	test_xmlrpc_net test_zipfile64
	Total duration: 3 min 54 sec
	Tests result: FAILURE

python3-module-virtualenv-20.1.0-alt1
	SKIPPED [1] tests/unit/activation/conftest.py:249: Fish(
	version=FileNotFoundError(2, 'No such file or directory'),
	creator=CPython3Posix(dest=/usr/src/tmp/pytest-of-builder/pytest-0/popen-gw4/activation-tester-env0/e-$
	èрт🚒♞中片-j, clear=False, global=False),
	interpreter=PythonInfo(spec=CPython3.8.6.final.0-64, system=/usr/bin/python3.8,
	exe=/usr/src/RPM/BUILD/python3-module-virtualenv-20.1.0/.tox/py3/bin/python,
	platform=linux, version='3.8.6 (default, Oct  2 2020, 00:06:33) \n[GCC 9.3.1 20200518
	(ALT Sisyphus 9.3.1-alt1)]', encoding_fs_io=utf-8-utf-8)) is not available due [Errno 2]
	No such file or directory: 'fish'
	SKIPPED [2] tests/conftest.py:344: could not find 2
	SKIPPED [1] tests/unit/activation/conftest.py:249: PowerShell(
	version=FileNotFoundError(2, 'No such file or directory'),
	creator=CPython3Posix(dest=/usr/src/tmp/pytest-of-builder/pytest-0/popen-gw7/activation-tester-env1/e-$
	èрт🚒♞中片-j, clear=False, global=False),
	interpreter=PythonInfo(spec=CPython3.8.6.final.0-64, system=/usr/bin/python3.8,
	exe=/usr/src/RPM/BUILD/python3-module-virtualenv-20.1.0/.tox/py3/bin/python,
	platform=linux, version='3.8.6 (default, Oct  2 2020, 00:06:33) \n[GCC 9.3.1 20200518
	(ALT Sisyphus 9.3.1-alt1)]', encoding_fs_io=utf-8-utf-8)) is not available due [Errno 2]
	No such file or directory: 'pwsh'
	SKIPPED [1] tests/unit/activation/conftest.py:249: PowerShell(
	version=FileNotFoundError(2, 'No such file or directory'),
	creator=CPython3Posix(dest=/usr/src/tmp/pytest-of-builder/pytest-0/popen-gw3/activation-tester-env0/e-$
	èрт🚒♞中片-j, clear=False, global=False),
	interpreter=PythonInfo(spec=CPython3.8.6.final.0-64, system=/usr/bin/python3.8,
	exe=/usr/src/RPM/BUILD/python3-module-virtualenv-20.1.0/.tox/py3/bin/python,
	platform=linux, version='3.8.6 (default, Oct  2 2020, 00:06:33) \n[GCC 9.3.1 20200518
	(ALT Sisyphus 9.3.1-alt1)]', encoding_fs_io=utf-8-utf-8)) is not available due [Errno 2]
	No such file or directory: 'pwsh'
	SKIPPED [2] tests/integration/test_zipapp.py:100: Requires internet connection
	SKIPPED [1] tests/unit/activation/conftest.py:249: Fish(
	version=FileNotFoundError(2, 'No such file or directory'),
	creator=CPython3Posix(dest=/usr/src/tmp/pytest-of-builder/pytest-0/popen-gw2/activation-tester-env0/e-$
	èрт🚒♞中片-j, clear=False, global=False),
	interpreter=PythonInfo(spec=CPython3.8.6.final.0-64, system=/usr/bin/python3.8,
	exe=/usr/src/RPM/BUILD/python3-module-virtualenv-20.1.0/.tox/py3/bin/python,
	platform=linux, version='3.8.6 (default, Oct  2 2020, 00:06:33) \n[GCC 9.3.1 20200518
	(ALT Sisyphus 9.3.1-alt1)]', encoding_fs_io=utf-8-utf-8)) is not available due [Errno 2]
	No such file or directory: 'fish'
	SKIPPED [1] tests/integration/test_run_int.py:13: Requires internet connection
	--
	SKIPPED [1] tests/unit/activation/conftest.py:249: Csh(
	version=FileNotFoundError(2, 'No such file or directory'),
	creator=CPython3Posix(dest=/usr/src/tmp/pytest-of-builder/pytest-0/popen-gw5/activation-tester-env0/e-$
	èрт🚒♞中片-j, clear=False, global=False),
	interpreter=PythonInfo(spec=CPython3.8.6.final.0-64, system=/usr/bin/python3.8,
	exe=/usr/src/RPM/BUILD/python3-module-virtualenv-20.1.0/.tox/py3/bin/python,
	platform=linux, version='3.8.6 (default, Oct  2 2020, 00:06:33) \n[GCC 9.3.1 20200518
	(ALT Sisyphus 9.3.1-alt1)]', encoding_fs_io=utf-8-utf-8)) is not available due [Errno 2]
	No such file or directory: 'csh'
	SKIPPED [1] tests/unit/activation/conftest.py:249: Csh(

racket-7.3-alt2
	raco setup: 5 re-rendering: <pkgs>/racket-index/scribblings/main/release.scrbl
	raco setup: 4 re-rendering: <pkgs>/scribble-doc/scribblings/scribble/scribble.scrbl
	raco setup: 3 re-rendering: <pkgs>/racket-index/scribblings/main/start.scrbl
	raco setup: 2 re-rendering:
	<pkgs>/typed-racket-doc/typed-racket/scribblings/ts-reference.scrbl
	raco setup: 1 re-rendering: <pkgs>/racket-index/scribblings/main/local-redirect.scrbl
	raco setup: 0 re-rendering: <pkgs>/racket-index/scribblings/main/search.scrbl
	make[1]: *** [Makefile:196: install-3m] CPU time limit exceeded
	make[1]: Leaving directory '/usr/src/RPM/BUILD/racket-7.3/src'
	make: *** [Makefile:119: install] Error 2
	make: Leaving directory '/usr/src/RPM/BUILD/racket-7.3/src'

stress-ng-0.11.23-alt1
	stress-ng: 05:45:49.58 info:  [4112523] dispatching hogs: 4 af-alg
	stress-ng: 05:45:49.58 error: [4112523] no CPUs found - is /sys mounted?
	stress-ng: 05:45:49.58 debug: [4112523] cache allocate: using defaults, can't determine
	cache details from sysfs
	--
	stress-ng: 05:45:50.59 info:  [4115259] dispatching hogs: 4 atomic
	stress-ng: 05:45:50.59 error: [4115259] no CPUs found - is /sys mounted?
	stress-ng: 05:45:50.59 debug: [4115259] cache allocate: using defaults, can't determine
	cache details from sysfs
	--
	stress-ng: 05:45:51.59 info:  [4117182] dispatching hogs: 4 branch
	stress-ng: 05:45:51.59 error: [4117182] no CPUs found - is /sys mounted?
	stress-ng: 05:45:51.59 debug: [4117182] cache allocate: using defaults, can't determine
	cache details from sysfs
	--
	stress-ng: 05:45:52.60 info:  [4118621] dispatching hogs: 4 cache
	stress-ng: 05:45:52.60 error: [4118621] no CPUs found - is /sys mounted?
	stress-ng: 05:45:52.60 debug: [4118621] cache allocate: using defaults, can't determine
	cache details from sysfs
	--
	stress-ng: 05:45:52.61 debug: [4118628] stress-ng-cache: using cache buffer size of 2048K
	hasher-priv: master: idle time limit (3600 seconds) exceeded

	9 error logs REMOVED from the list
chromium-86.0.4240.111-alt1
cilk-5.4.6-alt11
libgexiv2-0.12.1-alt1
python-module-cssutils-1.0.2-alt1
python-module-pysvn-1.9.12-alt1
python-module-pyxattr-docs-0.6.1-alt1
python3-module-pyxattr-docs-0.6.1-alt1
qt5-webengine-5.15.1-alt1
rss2email-3.12.1-alt1

Total 100 error logs.


Sisyphus-cybertalk