[cyber] I: Sisyphus-20201106 x86_64 beehive_status: +11 -17 (68)

ALT beekeeper hiver altlinux.org
6 10:02:52 MSK 2020


	11 NEW error logs

chromium-gost-86.0.4240.111-alt1
	warning: unknown warning option '-Wno-string-concatenation'; did you mean
	'-Wno-objc-string-concatenation'? [-Wunknown-warning-option]
	warning: unknown warning option '-Wno-max-tokens'; did you mean
	'-Wno-extra-tokens'? [-Wunknown-warning-option]
	3 warnings generated.
	[39815/43243] clang++ -MMD -MF
	obj/third_party/blink/renderer/core/input/input/touch_list.o.d -DUSE_UDEV
	-DUSE_AURA=1 -DUSE_GLIB=1 -DUSE_NSS_CERTS=1 -DUSE_X11=1 -DOFFICIAL_BUILD
	-D_FILE_OFFSET_BITS=64 -D_LARGEFILE_SOURCE -D_LARGEFILE64_SOURCE -DNO_UNWIND_TABLES
	-D_GNU_SOURCE -D__STDC_CONSTANT_MACROS -D__STDC_FORMAT_MACROS -D_FORTIFY_SOURCE=2
	-DNDEBUG -DNVALGRIND -DDYNAMIC_ANNOTATIONS_ENABLED=0 -DBLINK_CORE_IMPLEMENTATION=1
	-DGLIB_VERSION_MAX_ALLOWED=GLIB_VERSION_2_40 -DGLIB_VERSION_MIN_REQUIRED=GLIB_VERSION_2_40
	-DWEBP_EXTERN=extern -DVK_USE_PLATFORM_XCB_KHR -DGL_GLEXT_PROTOTYPES -DUSE_GLX
	-DUSE_EGL -DSK_CODEC_DECODES_PNG -DSK_CODEC_DECODES_WEBP -DSK_ENCODE_PNG
	-DSK_ENCODE_WEBP -DSK_USER_CONFIG_HEADER=\"../../skia/config/SkUserConfig.h\"
	-DSK_GL -DSK_CODEC_DECODES_JPEG -DSK_ENCODE_JPEG -DSK_USE_LIBGIFCODEC
	-DSK_VULKAN_HEADER=\"../../skia/config/SkVulkanConfig.h\" -DSK_VULKAN=1 -DSK_SUPPORT_GPU=1
	-DSK_GPU_WORKAROUNDS_HEADER=\"gpu/config/gpu_driver_bug_workaround_autogen.h\"
	-DVK_USE_PLATFORM_XCB_KHR -DBLINK_IMPLEMENTATION=1 -DINSIDE_BLINK -DU_USING_ICU_NAMESPACE=0
	-DU_ENABLE_DYLOAD=0 -DUSE_CHROMIUM_ICU=1 -DU_ENABLE_TRACING=1 -DU_ENABLE_RESOURCE_TRACING=0
	-DU_STATIC_IMPLEMENTATION -DICU_UTIL_DATA_IMPL=ICU_UTIL_DATA_FILE -DUCHAR_TYPE=uint16_t
	-DWEBRTC_NON_STATIC_TRACE_EVENT_HANDLERS=0 -DWEBRTC_CHROMIUM_BUILD -DWEBRTC_POSIX
	-DWEBRTC_LINUX -DABSL_ALLOCATOR_NOTHROW=1 -DWEBRTC_USE_BUILTIN_ISAC_FIX=0
	-DWEBRTC_USE_BUILTIN_ISAC_FLOAT=1 -DWEBRTC_USE_X11 -DHAVE_SCTP -DNO_MAIN_THREAD_WRAPPING
	-DGOOGLE_PROTOBUF_NO_RTTI -DGOOGLE_PROTOBUF_NO_STATIC_INITIALIZER
	-DHAVE_PTHREAD -DV8_COMPRESS_POINTERS -DV8_31BIT_SMIS_ON_64BIT_ARCH
	-DV8_DEPRECATION_WARNINGS -DCRASHPAD_ZLIB_SOURCE_EXTERNAL -DLEVELDB_PLATFORM_CHROMIUM=1
	-DLEVELDB_PLATFORM_CHROMIUM=1 -DSUPPORT_WEBGL2_COMPUTE_CONTEXT=1 -DWTF_USE_WEBAUDIO_PFFFT=1
	-DUSE_BLINK_V8_BINDING_NEW_IDL_INTERFACE -DUSE_LIBJPEG_TURBO=1 -DV8_COMPRESS_POINTERS
	-DV8_31BIT_SMIS_ON_64BIT_ARCH -DV8_DEPRECATION_WARNINGS -DLIBXSLT_STATIC -I../.. -Igen
	-I../../third_party/perfetto/include -Igen/third_party/perfetto/build_config
	-Igen/third_party/perfetto -I../../third_party/libwebp/src
	-I../../third_party/libyuv/include -I../../third_party/jsoncpp/source/include
	-I../../third_party/jsoncpp/generated -Igen/shim_headers/opus_shim
	-Igen/shim_headers/ffmpeg_shim -I../../third_party/vulkan_headers/include
	-I../../third_party/khronos -I../../gpu -Igen/third_party/dawn/src/include
	-I../../third_party/dawn/src/include -I../../third_party/abseil-cpp
	-I../../third_party/boringssl/src/include -I../../third_party/protobuf/src
	-Igen/protoc_out -I../../third_party/skia -I../../third_party/libgifcodec
	-I../../third_party/vulkan/include -I../../third_party/vulkan_headers/include
	-I../../third_party/ced/src -I../../third_party/icu/source/common
	-I../../third_party/icu/source/i18n -I../../third_party/webrtc_overrides
	-I../../third_party/webrtc -Igen/third_party/webrtc -I../../third_party/protobuf/src
	-I../../third_party/angle/include -I../../third_party/angle/src/common/third_party/base
	-Igen/angle -I../../third_party/angle/include -I../../v8/include -Igen/v8/include
	-I../../third_party/crashpad/crashpad -I../../third_party/crashpad/crashpad/compat/non_mac
	-I../../third_party/crashpad/crashpad/compat/linux
	-I../../third_party/crashpad/crashpad/compat/non_win -I../../third_party/zlib
	-I../../third_party/libwebm/source -I../../third_party/leveldatabase
	-I../../third_party/leveldatabase/src -I../../third_party/leveldatabase/src/include
	-I../../third_party/mesa_headers -I../../third_party/libjpeg_turbo
	-I../../third_party/iccjpeg -I../../third_party/libpng -I../../third_party/ots/include
	-I../../v8/include -Igen/v8/include -I../../third_party/libxml/src/include
	-I../../third_party/libxml/linux/include -I../../third_party/libxslt/src
	-I../../third_party/snappy/src -I../../third_party/snappy/linux
	-fprofile-sample-use=../../chrome/android/profiles/afdo.prof
	-fno-strict-aliasing --param=ssp-buffer-size=4 -fstack-protector -fno-unwind-tables
	-fno-asynchronous-unwind-tables -fPIC -pthread -fcolor-diagnostics -fmerge-all-constants
	-fcrash-diag
	warning: unknown warning option '-Wno-psabi' [-Wunknown-warning-option]
	warning: unknown warning option '-Wno-string-concatenation'; did you mean
	'-Wno-objc-string-concatenation'? [-Wunknown-warning-option]
	warning: unknown warning option '-Wno-max-tokens'; did you mean
	'-Wno-extra-tokens'? [-Wunknown-warning-option]
	3 warnings generated.
	[39816/43243] clang++ -MMD -MF
	obj/third_party/blink/renderer/core/input/input/mouse_wheel_event_manager.o.d
	-DUSE_UDEV -DUSE_AURA=1 -DUSE_GLIB=1 -DUSE_NSS_CERTS=1 -DUSE_X11=1 -DOFFICIAL_BUILD
	-D_FILE_OFFSET_BITS=64 -D_LARGEFILE_SOURCE -D_LARGEFILE64_SOURCE -DNO_UNWIND_TABLES
	-D_GNU_SOURCE -D__STDC_CONSTANT_MACROS -D__STDC_FORMAT_MACROS -D_FORTIFY_SOURCE=2
	-DNDEBUG -DNVALGRIND -DDYNAMIC_ANNOTATIONS_ENABLED=0 -DBLINK_CORE_IMPLEMENTATION=1
	-DGLIB_VERSION_MAX_ALLOWED=GLIB_VERSION_2_40 -DGLIB_VERSION_MIN_REQUIRED=GLIB_VERSION_2_40
	-DWEBP_EXTERN=extern -DVK_USE_PLATFORM_XCB_KHR -DGL_GLEXT_PROTOTYPES -DUSE_GLX
	-DUSE_EGL -DSK_CODEC_DECODES_PNG -DSK_CODEC_DECODES_WEBP -DSK_ENCODE_PNG
	-DSK_ENCODE_WEBP -DSK_USER_CONFIG_HEADER=\"../../skia/config/SkUserConfig.h\"
	-DSK_GL -DSK_CODEC_DECODES_JPEG -DSK_ENCODE_JPEG -DSK_USE_LIBGIFCODEC
	-DSK_VULKAN_HEADER=\"../../skia/config/SkVulkanConfig.h\" -DSK_VULKAN=1 -DSK_SUPPORT_GPU=1
	-DSK_GPU_WORKAROUNDS_HEADER=\"gpu/config/gpu_driver_bug_workaround_autogen.h\"
	-DVK_USE_PLATFORM_XCB_KHR -DBLINK_IMPLEMENTATION=1 -DINSIDE_BLINK -DU_USING_ICU_NAMESPACE=0
	-DU_ENABLE_DYLOAD=0 -DUSE_CHROMIUM_ICU=1 -DU_ENABLE_TRACING=1 -DU_ENABLE_RESOURCE_TRACING=0
	-DU_STATIC_IMPLEMENTATION -DICU_UTIL_DATA_IMPL=ICU_UTIL_DATA_FILE -DUCHAR_TYPE=uint16_t
	-DWEBRTC_NON_STATIC_TRACE_EVENT_HANDLERS=0 -DWEBRTC_CHROMIUM_BUILD -DWEBRTC_POSIX
	-DWEBRTC_LINUX -DABSL_ALLOCATOR_NOTHROW=1 -DWEBRTC_USE_BUILTIN_ISAC_FIX=0
	-DWEBRTC_USE_BUILTIN_ISAC_FLOAT=1 -DWEBRTC_USE_X11 -DHAVE_SCTP -DNO_MAIN_THREAD_WRAPPING
	-DGOOGLE_PROTOBUF_NO_RTTI -DGOOGLE_PROTOBUF_NO_STATIC_INITIALIZER
	-DHAVE_PTHREAD -DV8_COMPRESS_POINTERS -DV8_31BIT_SMIS_ON_64BIT_ARCH
	-DV8_DEPRECATION_WARNINGS -DCRASHPAD_ZLIB_SOURCE_EXTERNAL -DLEVELDB_PLATFORM_CHROMIUM=1
	-DLEVELDB_PLATFORM_CHROMIUM=1 -DSUPPORT_WEBGL2_COMPUTE_CONTEXT=1 -DWTF_USE_WEBAUDIO_PFFFT=1
	-DUSE_BLINK_V8_BINDING_NEW_IDL_INTERFACE -DUSE_LIBJPEG_TURBO=1 -DV8_COMPRESS_POINTERS
	-DV8_31BIT_SMIS_ON_64BIT_ARCH -DV8_DEPRECATION_WARNINGS -DLIBXSLT_STATIC -I../.. -Igen
	-I../../third_party/perfetto/include -Igen/third_party/perfetto/build_config
	-Igen/third_party/perfetto -I../../third_party/libwebp/src
	-I../../third_party/libyuv/include -I../../third_party/jsoncpp/source/include
	-I../../third_party/jsoncpp/generated -Igen/shim_headers/opus_shim
	-Igen/shim_headers/ffmpeg_shim -I../../third_party/vulkan_headers/include
	-I../../third_party/khronos -I../../gpu -Igen/third_party/dawn/src/include
	-I../../third_party/dawn/src/include -I../../third_party/abseil-cpp
	-I../../third_party/boringssl/src/include -I../../third_party/protobuf/src
	-Igen/protoc_out -I../../third_party/skia -I../../third_party/libgifcodec
	-I../../third_party/vulkan/include -I../../third_party/vulkan_headers/include
	-I../../third_party/ced/src -I../../third_party/icu/source/common
	-I../../third_party/icu/source/i18n -I../../third_party/webrtc_overrides
	-I../../third_party/webrtc -Igen/third_party/webrtc -I../../third_party/protobuf/src
	-I../../third_party/angle/include -I../../third_party/angle/src/common/third_party/base
	-Igen/angle -I../../third_party/angle/include -I../../v8/include -Igen/v8/include
	-I../../third_party/crashpad/crashpad -I../../third_party/crashpad/crashpad/compat/non_mac
	-I../../third_party/crashpad/crashpad/compat/linux
	-I../../third_party/crashpad/crashpad/compat/non_win -I../../third_party/zlib
	-I../../third_party/libwebm/source -I../../third_party/leveldatabase
	-I../../third_party/leveldatabase/src -I../../third_party/leveldatabase/src/include
	-I../../third_party/mesa_headers -I../../third_party/libjpeg_turbo
	-I../../third_party/iccjpeg -I../../third_party/libpng -I../../third_party/ots/include
	-I../../v8/include -Igen/v8/include -I../../third_party/libxml/src/include
	-I../../third_party/libxml/linux/include -I../../third_party/libxslt/src
	-I../../third_party/snappy/src -I../../third_party/snappy/linux
	-fprofile-sample-use=../../chrome/android/profiles/afdo.prof -fno-strict-aliasing
	--param=ssp-buffer-size=4 -fstack-protector -fno-unwind-tables
	-fno-asynchronous-unwind-tables -fPIC -pthread -fcolor-diagnostics -fmerge-all-constan
	hasher-priv: master: time elapsed limit (25000 seconds) exceeded

freeipa-healthcheck-0.6-alt2
	>	assert result.result == constants.SUCCESS
	E	AssertionError: assert 10 == 0
	E	 +  where 10 = ipahealthcheck.ipa.certs.IPACertmongerExpirationCheck({'key':
	'5678', 'expiration_date': '20201205214850Z', 'days': 29... expires in {days}
	days. certmonger should renew this automatically. Watch the status withgetcert list -i
	{key}.'}): 10.result
	--
	=========================== short test summary info ============================
	FAILED tests/test_ipa_expiration.py::TestExpiration::test_expiration_warning
	======================== 1 failed, 110 passed in 4.17s =========================
	ERROR: InvocationError for command
	/usr/src/RPM/BUILD/freeipa-healthcheck-0.6/.tox/py3/bin/python -m pytest (exited with
	code 1)
	py3 finish: run-test  after 4.89 seconds
	--
	___________________________________ summary ____________________________________
	ERROR:	 py3: commands failed
	cleanup
	/usr/src/RPM/BUILD/freeipa-healthcheck-0.6/.tox/.tmp/package/1/ipahealthcheck-0.6.zip

jed-2:0.99.19-alt2.qa2.1
	/usr/bin/ld.default: menu.o: file not recognized: file truncated
	collect2: error: ld returned 1 exit status
	make[1]: *** [Makefile:188: /usr/src/RPM/BUILD/jed-0.99-19/src/objs/xjed] Error 1

jicofo-1.1-alt0.3
	Results :
	Tests in error:
	BundleTest.testBundle:97 ? Runtime user1 - wait for invite timeout

libgupnp-igd-1.2.0-alt1
	Full log written to
	/usr/src/RPM/BUILD/gupnp-igd-1.2.0/x86_64-alt-linux/meson-logs/testlog.txt
	FAILED: meson-test
	/usr/bin/meson test --no-rebuild --print-errorlogs

perl-Test-LectroTest-0.5001-alt3
	t/docs-eg.t ............... ok
	#   Failed test 'String(length=>[0,9]) elem length dist mean is 4.5 (z-score = -4.14)'
	#   at t/gens.t line 1177.
	--
	t/gens.t		(Wstat: 256 Tests: 248 Failed: 1)
	Failed test:  194
	Non-zero exit status: 1
	--
	Result: FAIL
	Failed 1/12 test programs. 1/343 subtests failed.
	make: *** [Makefile:783: test_dynamic] Error 255

perl-autovivification-0.18-alt2_8
	Result: FAIL
	Failed 1/18 test programs. 0/44599 subtests failed.
	make: *** [Makefile:933: test_dynamic] Error 255

python-module-oauth2client-4.1.3-alt3
	==================================== ERRORS ====================================
	______________ ERROR collecting tests/contrib/test_flask_util.py _______________
	ImportError while importing test module
	'/usr/src/RPM/BUILD/python-module-oauth2client-4.1.3/tests/contrib/test_flask_util.py'.
	--
	import flask
	E   ImportError: No module named flask
	=============================== warnings summary ===============================

python3-module-virtualenv-20.1.0-alt1
	SKIPPED [1] tests/unit/activation/conftest.py:249: Csh(
	version=FileNotFoundError(2, 'No such file or directory'),
	creator=CPython3Posix(dest=/usr/src/tmp/pytest-of-builder/pytest-0/popen-gw0/activation-tester-env0/e-$
	èрт🚒♞中片-j, clear=False, global=False),
	interpreter=PythonInfo(spec=CPython3.8.6.final.0-64, system=/usr/bin/python3.8,
	exe=/usr/src/RPM/BUILD/python3-module-virtualenv-20.1.0/.tox/py3/bin/python,
	platform=linux, version='3.8.6 (default, Oct  2 2020, 00:06:33) \n[GCC 9.3.1 20200518
	(ALT Sisyphus 9.3.1-alt1)]', encoding_fs_io=utf-8-utf-8)) is not available due [Errno 2]
	No such file or directory: 'csh'
	SKIPPED [1] tests/unit/activation/conftest.py:249: Fish(
	version=FileNotFoundError(2, 'No such file or directory'),
	creator=CPython3Posix(dest=/usr/src/tmp/pytest-of-builder/pytest-0/popen-gw5/activation-tester-env0/e-$
	èрт🚒♞中片-j, clear=False, global=False),
	interpreter=PythonInfo(spec=CPython3.8.6.final.0-64, system=/usr/bin/python3.8,
	exe=/usr/src/RPM/BUILD/python3-module-virtualenv-20.1.0/.tox/py3/bin/python,
	platform=linux, version='3.8.6 (default, Oct  2 2020, 00:06:33) \n[GCC 9.3.1 20200518
	(ALT Sisyphus 9.3.1-alt1)]', encoding_fs_io=utf-8-utf-8)) is not available due [Errno 2]
	No such file or directory: 'fish'
	SKIPPED [2] tests/unit/activation/conftest.py:246: BatchActivator not supported
	--
	SKIPPED [1] tests/unit/activation/conftest.py:249: Csh(
	version=FileNotFoundError(2, 'No such file or directory'),
	creator=CPython3Posix(dest=/usr/src/tmp/pytest-of-builder/pytest-0/popen-gw7/activation-tester-env1/e-$
	èрт🚒♞中片-j, clear=False, global=False),
	interpreter=PythonInfo(spec=CPython3.8.6.final.0-64, system=/usr/bin/python3.8,
	exe=/usr/src/RPM/BUILD/python3-module-virtualenv-20.1.0/.tox/py3/bin/python,
	platform=linux, version='3.8.6 (default, Oct  2 2020, 00:06:33) \n[GCC 9.3.1 20200518
	(ALT Sisyphus 9.3.1-alt1)]', encoding_fs_io=utf-8-utf-8)) is not available due [Errno 2]
	No such file or directory: 'csh'
	SKIPPED [1] tests/unit/activation/conftest.py:249: Fish(
	version=FileNotFoundError(2, 'No such file or directory'),
	creator=CPython3Posix(dest=/usr/src/tmp/pytest-of-builder/pytest-0/popen-gw2/activation-tester-env0/e-$
	èрт🚒♞中片-j, clear=False, global=False),
	interpreter=PythonInfo(spec=CPython3.8.6.final.0-64, system=/usr/bin/python3.8,
	exe=/usr/src/RPM/BUILD/python3-module-virtualenv-20.1.0/.tox/py3/bin/python,
	platform=linux, version='3.8.6 (default, Oct  2 2020, 00:06:33) \n[GCC 9.3.1 20200518
	(ALT Sisyphus 9.3.1-alt1)]', encoding_fs_io=utf-8-utf-8)) is not available due [Errno 2]
	No such file or directory: 'fish'
	SKIPPED [1] tests/unit/test_util.py:19: subprocess patch only applied on Windows python2
	--
	SKIPPED [1] tests/unit/activation/conftest.py:249: PowerShell(
	version=FileNotFoundError(2, 'No such file or directory'),
	creator=CPython3Posix(dest=/usr/src/tmp/pytest-of-builder/pytest-0/popen-gw4/activation-tester-env0/e-$
	èрт🚒♞中片-j, clear=False, global=False),
	interpreter=PythonInfo(spec=CPython3.8.6.final.0-64, system=/usr/bin/python3.8,
	exe=/usr/src/RPM/BUILD/python3-module-virtualenv-20.1.0/.tox/py3/bin/python,
	platform=linux, version='3.8.6 (default, Oct  2 2020, 00:06:33) \n[GCC 9.3.1 20200518
	(ALT Sisyphus 9.3.1-alt1)]', encoding_fs_io=utf-8-utf-8)) is not available due [Errno 2]
	No such file or directory: 'pwsh'
	SKIPPED [1] tests/unit/activation/conftest.py:249: PowerShell(

qt5-webengine-5.15.1-alt1
	[16548/27822] /usr/bin/g++ -MMD -MF obj/content/browser/browser/render_frame_host_impl.o.d
	-DUSE_UDEV -DUSE_AURA=1 -DUSE_NSS_CERTS=1 -DUSE_OZONE=1 -DOFFICIAL_BUILD
	-DTOOLKIT_QT -D_FILE_OFFSET_BITS=64 -D_LARGEFILE_SOURCE -D_LARGEFILE64_SOURCE
	-DNO_UNWIND_TABLES -D__STDC_CONSTANT_MACROS -D__STDC_FORMAT_MACROS
	-DNDEBUG -DNVALGRIND -DDYNAMIC_ANNOTATIONS_ENABLED=0 -DCONTENT_IMPLEMENTATION
	-DVK_NO_PROTOTYPES -DGL_GLEXT_PROTOTYPES -DUSE_GLX -DUSE_EGL -DUSING_SYSTEM_ICU=1
	-DICU_UTIL_DATA_IMPL=ICU_UTIL_DATA_STATIC -DUCHAR_TYPE=uint16_t -DGOOGLE_PROTOBUF_NO_RTTI
	-DGOOGLE_PROTOBUF_NO_STATIC_INITIALIZER -DHAVE_PTHREAD -DSK_HAS_PNG_LIBRARY
	-DSK_HAS_WEBP_LIBRARY -DSK_USER_CONFIG_HEADER=\"../../skia/config/SkUserConfig.h\"
	-DSK_GL -DSK_HAS_JPEG_LIBRARY -DSK_USE_LIBGIFCODEC
	-DSK_VULKAN_HEADER=\"../../skia/config/SkVulkanConfig.h\" -DSK_VULKAN=1 -DSK_SUPPORT_GPU=1
	-DSK_GPU_WORKAROUNDS_HEADER=\"gpu/config/gpu_driver_bug_workaround_autogen.h\"
	-DVK_NO_PROTOTYPES -DLEVELDB_PLATFORM_CHROMIUM=1 -DLEVELDB_PLATFORM_CHROMIUM=1
	-DWEBRTC_NON_STATIC_TRACE_EVENT_HANDLERS=0 -DWEBRTC_CHROMIUM_BUILD -DWEBRTC_POSIX
	-DWEBRTC_LINUX -DABSL_ALLOCATOR_NOTHROW=1 -DWEBRTC_USE_BUILTIN_ISAC_FIX=0
	-DWEBRTC_USE_BUILTIN_ISAC_FLOAT=1 -DWEBRTC_USE_X11 -DHAVE_SCTP -DNO_MAIN_THREAD_WRAPPING
	-DSQLITE_ENABLE_BATCH_ATOMIC_WRITE -DSQLITE_ENABLE_FTS3 -DSQLITE_DISABLE_FTS3_UNICODE
	-DSQLITE_DISABLE_FTS4_DEFERRED -DSQLITE_ENABLE_ICU -DSQLITE_SECURE_DELETE
	-DSQLITE_THREADSAFE=1 -DSQLITE_MAX_WORKER_THREADS=0 -DSQLITE_MAX_MMAP_SIZE=268435456
	-DSQLITE_DEFAULT_FILE_PERMISSIONS=0600 -DSQLITE_DEFAULT_MEMSTATUS=1
	-DSQLITE_DEFAULT_PAGE_SIZE=4096 -DSQLITE_DEFAULT_PCACHE_INITSZ=0
	-DSQLITE_LIKE_DOESNT_MATCH_BLOBS -DSQLITE_OMIT_DEPRECATED -DSQLITE_OMIT_PROGRESS_CALLBACK
	-DSQLITE_OMIT_SHARED_CACHE -DSQLITE_USE_ALLOCA -DSQLITE_OMIT_ANALYZE
	-DSQLITE_OMIT_AUTOINIT -DSQLITE_OMIT_AUTORESET -DSQLITE_OMIT_COMPILEOPTION_DIAGS
	-DSQLITE_OMIT_COMPLETE -DSQLITE_OMIT_DECLTYPE -DSQLITE_OMIT_EXPLAIN
	-DSQLITE_OMIT_GET_TABLE -DSQLITE_OMIT_LOAD_EXTENSION -DSQLITE_DEFAULT_LOOKASIDE=0,0
	-DSQLITE_OMIT_LOOKASIDE -DSQLITE_OMIT_TCL_VARIABLE -DSQLITE_OMIT_REINDEX
	-DSQLITE_OMIT_TRACE -DSQLITE_OMIT_UPSERT -DSQLITE_OMIT_WINDOWFUNC -DSQLITE_HAVE_ISNAN
	-DSQLITE_TEMP_STORE=3 -DSQLITE_ENABLE_LOCKING_STYLE=0 -DPERFETTO_IMPLEMENTATION
	-DUSE_VULKAN_XLIB -DV8_COMPRESS_POINTERS -DV8_31BIT_SMIS_ON_64BIT_ARCH
	-DV8_DEPRECATION_WARNINGS -DUSING_SYSTEM_ICU=1 -DICU_UTIL_DATA_IMPL=ICU_UTIL_DATA_STATIC
	-DUCHAR_TYPE=uint16_t -DAUDIO_PROCESSING_IN_AUDIO_SERVICE -DUSE_SYSTEM_ZLIB=1
	-Igen -I../../../../src/3rdparty/chromium -Igen -Igen -Igen -Igen -Igen -Igen
	-Igen -I../../../../src/3rdparty/chromium/third_party/vulkan/include -Igen
	-I../../../../src/3rdparty/chromium/third_party/perfetto/include
	-Igen/third_party/perfetto/build_config
	-I../../../../src/3rdparty/chromium/third_party/libyuv/include -Igen -Igen -Igen
	-Igen -Igen -Igen -I../../../../src/3rdparty/chromium/third_party/khronos
	-I../../../../src/3rdparty/chromium/gpu -Igen
	-I../../../../src/3rdparty/chromium/third_party/jsoncpp/source/include
	-I../../../../src/3rdparty/chromium/third_party/jsoncpp/generated
	-Igen/third_party/dawn/src/include
	-I../../../../src/3rdparty/chromium/third_party/dawn/src/include -Igen
	-I../../../../src/3rdparty/chromium/third_party/boringssl/src/include
	-I../../../../src/3rdparty/chromium/third_party/ced/src
	-I../../../../src/3rdparty/chromium/third_party/protobuf/src
	-I../../../../src/3rdparty/chromium/third_party/skia
	-I../../../../src/3rdparty/chromium/third_party/libgifcodec
	-I../../../../src/3rdparty/chromium/third_party/vulkan/include
	-I../../../../src/3rdparty/chromium/third_party/skia/third_party/vulkanmemoryallocator
	-I../../../../src/3rdparty/chromium/third_party/vulkan/include
	-I../../../../src/3rdparty/chromium/third_party/crashpad/crashpad
	-I../../../../src/3rdparty/chromium/third_party/crashpad/crashpad/compat/non_mac
	-I../../../../src/3rdparty/chromium/third_party/crashpad/crashpad/compat/linux
	-I../../../../src/3rdparty/chromium/third_party/crashpad/crashpad/compat/non_win
	-I../../../../src/3rdparty/chromium/third_party/libwebm/source -
	FAILED: obj/content/browser/browser/render_frame_host_impl.o
	/usr/bin/g++ -MMD -MF obj/content/browser/browser/render_frame_host_impl.o.d
	-DUSE_UDEV -DUSE_AURA=1 -DUSE_NSS_CERTS=1 -DUSE_OZONE=1 -DOFFICIAL_BUILD
	-DTOOLKIT_QT -D_FILE_OFFSET_BITS=64 -D_LARGEFILE_SOURCE -D_LARGEFILE64_SOURCE
	-DNO_UNWIND_TABLES -D__STDC_CONSTANT_MACROS -D__STDC_FORMAT_MACROS
	-DNDEBUG -DNVALGRIND -DDYNAMIC_ANNOTATIONS_ENABLED=0 -DCONTENT_IMPLEMENTATION
	-DVK_NO_PROTOTYPES -DGL_GLEXT_PROTOTYPES -DUSE_GLX -DUSE_EGL -DUSING_SYSTEM_ICU=1
	-DICU_UTIL_DATA_IMPL=ICU_UTIL_DATA_STATIC -DUCHAR_TYPE=uint16_t -DGOOGLE_PROTOBUF_NO_RTTI
	-DGOOGLE_PROTOBUF_NO_STATIC_INITIALIZER -DHAVE_PTHREAD -DSK_HAS_PNG_LIBRARY
	-DSK_HAS_WEBP_LIBRARY -DSK_USER_CONFIG_HEADER=\"../../skia/config/SkUserConfig.h\"
	-DSK_GL -DSK_HAS_JPEG_LIBRARY -DSK_USE_LIBGIFCODEC
	-DSK_VULKAN_HEADER=\"../../skia/config/SkVulkanConfig.h\" -DSK_VULKAN=1 -DSK_SUPPORT_GPU=1
	-DSK_GPU_WORKAROUNDS_HEADER=\"gpu/config/gpu_driver_bug_workaround_autogen.h\"
	-DVK_NO_PROTOTYPES -DLEVELDB_PLATFORM_CHROMIUM=1 -DLEVELDB_PLATFORM_CHROMIUM=1
	-DWEBRTC_NON_STATIC_TRACE_EVENT_HANDLERS=0 -DWEBRTC_CHROMIUM_BUILD -DWEBRTC_POSIX
	-DWEBRTC_LINUX -DABSL_ALLOCATOR_NOTHROW=1 -DWEBRTC_USE_BUILTIN_ISAC_FIX=0
	-DWEBRTC_USE_BUILTIN_ISAC_FLOAT=1 -DWEBRTC_USE_X11 -DHAVE_SCTP -DNO_MAIN_THREAD_WRAPPING
	-DSQLITE_ENABLE_BATCH_ATOMIC_WRITE -DSQLITE_ENABLE_FTS3 -DSQLITE_DISABLE_FTS3_UNICODE
	-DSQLITE_DISABLE_FTS4_DEFERRED -DSQLITE_ENABLE_ICU -DSQLITE_SECURE_DELETE
	-DSQLITE_THREADSAFE=1 -DSQLITE_MAX_WORKER_THREADS=0 -DSQLITE_MAX_MMAP_SIZE=268435456
	-DSQLITE_DEFAULT_FILE_PERMISSIONS=0600 -DSQLITE_DEFAULT_MEMSTATUS=1
	-DSQLITE_DEFAULT_PAGE_SIZE=4096 -DSQLITE_DEFAULT_PCACHE_INITSZ=0
	-DSQLITE_LIKE_DOESNT_MATCH_BLOBS -DSQLITE_OMIT_DEPRECATED -DSQLITE_OMIT_PROGRESS_CALLBACK
	-DSQLITE_OMIT_SHARED_CACHE -DSQLITE_USE_ALLOCA -DSQLITE_OMIT_ANALYZE
	-DSQLITE_OMIT_AUTOINIT -DSQLITE_OMIT_AUTORESET -DSQLITE_OMIT_COMPILEOPTION_DIAGS
	-DSQLITE_OMIT_COMPLETE -DSQLITE_OMIT_DECLTYPE -DSQLITE_OMIT_EXPLAIN
	-DSQLITE_OMIT_GET_TABLE -DSQLITE_OMIT_LOAD_EXTENSION -DSQLITE_DEFAULT_LOOKASIDE=0,0
	-DSQLITE_OMIT_LOOKASIDE -DSQLITE_OMIT_TCL_VARIABLE -DSQLITE_OMIT_REINDEX
	-DSQLITE_OMIT_TRACE -DSQLITE_OMIT_UPSERT -DSQLITE_OMIT_WINDOWFUNC -DSQLITE_HAVE_ISNAN
	-DSQLITE_TEMP_STORE=3 -DSQLITE_ENABLE_LOCKING_STYLE=0 -DPERFETTO_IMPLEMENTATION
	-DUSE_VULKAN_XLIB -DV8_COMPRESS_POINTERS -DV8_31BIT_SMIS_ON_64BIT_ARCH
	-DV8_DEPRECATION_WARNINGS -DUSING_SYSTEM_ICU=1 -DICU_UTIL_DATA_IMPL=ICU_UTIL_DATA_STATIC
	-DUCHAR_TYPE=uint16_t -DAUDIO_PROCESSING_IN_AUDIO_SERVICE -DUSE_SYSTEM_ZLIB=1
	-Igen -I../../../../src/3rdparty/chromium -Igen -Igen -Igen -Igen -Igen -Igen
	-Igen -I../../../../src/3rdparty/chromium/third_party/vulkan/include -Igen
	-I../../../../src/3rdparty/chromium/third_party/perfetto/include
	-Igen/third_party/perfetto/build_config
	-I../../../../src/3rdparty/chromium/third_party/libyuv/include -Igen -Igen -Igen
	-Igen -Igen -Igen -I../../../../src/3rdparty/chromium/third_party/khronos
	-I../../../../src/3rdparty/chromium/gpu -Igen
	-I../../../../src/3rdparty/chromium/third_party/jsoncpp/source/include
	-I../../../../src/3rdparty/chromium/third_party/jsoncpp/generated
	-Igen/third_party/dawn/src/include
	-I../../../../src/3rdparty/chromium/third_party/dawn/src/include -Igen
	-I../../../../src/3rdparty/chromium/third_party/boringssl/src/include
	-I../../../../src/3rdparty/chromium/third_party/ced/src
	-I../../../../src/3rdparty/chromium/third_party/protobuf/src
	-I../../../../src/3rdparty/chromium/third_party/skia
	-I../../../../src/3rdparty/chromium/third_party/libgifcodec
	-I../../../../src/3rdparty/chromium/third_party/vulkan/include
	-I../../../../src/3rdparty/chromium/third_party/skia/third_party/vulkanmemoryallocator
	-I../../../../src/3rdparty/chromium/third_party/vulkan/include
	-I../../../../src/3rdparty/chromium/third_party/crashpad/crashpad
	-I../../../../src/3rdparty/chromium/third_party/crashpad/crashpad/compat/non_mac
	-I../../../../src/3rdparty/chromium/third_party/crashpad/crashpad/compat/linux
	-I../../../../src/3rdparty/chromium/third_party/crashpad/crashpad/compat/non_win
	-I../../../../src/3rdparty/chromium/third_party/libwebm/source -I../../../../s
	x86_64-alt-linux-g++: fatal error: Killed signal terminated program cc1plus
	compilation terminated.

transgui-5.18.0-alt2
	$0000rid.pas(1459,53) Заметка: (6058) Call to subroutine "operator :=(const
	source:WideString):Variant;" marked as inline is not inlined
	(1008) 1909 строк скомпилиpовано, 0.7 сек.
	(1022) 4 подсказок
	(1023) 19 заметок
	0000005BDA3B
	$00000000004047EB
	$00000000004041A3
	$0000000000402423
	$0000000000407B83
	$000000000040A799

	17 error logs REMOVED from the list
apache2-mod_perl-2.0.10-alt4.2
dpkt-1.9.1-alt1
ipython-5.5.0-alt7
libsmi-0.5.0-alt1.svn1841
proftpd-1.3.6-alt0.4.ga73dbfe3b
python-module-argcomplete-1.9.4-alt2
python-module-cligj-0.5.0-alt1
python-module-mercantile-0.10.0-alt1.1
python-module-oauthlib-0.7.2-alt1.1.2
python3-3.8.6-alt1
python3-module-click-plugins-1.0.2-alt3
python3-module-numdifftools-0.9.12-alt2.git20150828.1
python3-module-pexpect-4.8.0-alt1
python3-module-rasterio-1.1.8-alt1
python3-module-scikit-image-0.17.2-alt2
pywinery-0.3.2-alt2
quilt-0.66-alt1

Total 68 error logs.


Sisyphus-cybertalk