[cyber] I: Sisyphus-20201105 i586 beehive_status: +19 -12 (74)

ALT beekeeper hiver altlinux.org
5 16:03:56 MSK 2020


	19 NEW error logs

atlas-3.9.35-alt1.qa1
	/usr/src/RPM/BUILD/ATLAS/BUILD/..//include/atlas_mmparse.h: In function 'Parse
	hasher-priv: master: idle time limit (3600 seconds) exceeded

ipython-5.5.0-alt7
	rpm-build-python is already the newest version.
	E: Couldn't find package python-module-pexpect
	hsh-install: Failed to calculate package file list.

jboss-common-core-0:2.5.0-alt1_7jpp8
	[ERROR]
	testGarbageCollectedClassLoader(org.jboss.test.util.test.loading.ConstructorTCCLClassLoaderSourceUnitTestCase)
	Time elapsed: 0.022 s  <<< FAILURE!
	junit.framework.AssertionFailedError: ClassLoader garbage collected
	at
	org.jboss.test.util.test.loading.ConstructorTCCLClassLoaderSourceUnitTestCase.testGarbageCollectedClassLoader(ConstructorTCCLClassLoaderSourceUnitTestCase.java:63)

libgupnp-igd-1.2.0-alt1
	g-ir-scanner: link: i586-alt-linux-gcc -pthread -o
	/usr/src/RPM/BUILD/gupnp-igd-1.2.0/i586-alt-linux/tmp-introspect_kkz82jp/GUPnPIgd-1.0
	-pipe -frecord-gcc-switches -Wall -g -O2 -march=i586 -mtune=generic
	/usr/src/RPM/BUILD/gupnp-igd-1.2.0/i586-alt-linux/tmp-introspect_kkz82jp/GUPnPIgd-1.0.o
	-L. -Wl,-rpath,. -Wl,--no-as-needed
	-L/usr/src/RPM/BUILD/gupnp-igd-1.2.0/i586-alt-linux/libgupnp-igd
	-Wl,-rpath,/usr/src/RPM/BUILD/gupnp-igd-1.2.0/i586-alt-linux/libgupnp-igd -lgupnp-igd-1.0
	-lglib-2.0 -lgobject-2.0 -lgupnp-1.2 -lgmodule-2.0 -lgssdp-1.2 -lsoup-2.4 -lgio-2.0
	-lxml2 -lgthread-2.0 -lgirepository-1.0 -lgio-2.0 -lgobject-2.0 -Wl,--export-dynamic
	-lgmodule-2.0 -pthread -lglib-2.0
	/usr/lib/gcc/i586-alt-linux/9/include/stddef.h:424: syntax error, unexpected identifier
	in '  __float128 __max_align_f128 __attribute__((__aligned__(__alignof(__float128))));'
	at '__float128'
	[16/16] Generating GUPnPIgd-1.0.typelib with a custom command
	--
	Full log written to
	/usr/src/RPM/BUILD/gupnp-igd-1.2.0/i586-alt-linux/meson-logs/testlog.txt
	FAILED: meson-test
	/usr/bin/meson test --no-rebuild --print-errorlogs

liboil-0.3.17-alt1.qa1
	../test-driver: line 109: 1634627 Segmentation fault	  "$@" > $log_file 2>&1
	FAIL: stride
	PASS: dso_check
	--
	# SKIP:  0
	# XFAIL: 0
	# FAIL:  1
	# XPASS: 0
	# ERROR: 0
	See testsuite/test-suite.log

offlineimap-7.2.4-alt2
	sphinx-build -b html -d html/doctrees doc-src html
	make: sphinx-build: No such file or directory
	make: *** [Makefile:37: api] Error 127

openvswitch-2.14.0-alt1
	Processing files: openvswitch-2.14.0-alt1
	error: File not found by glob:
	/usr/src/tmp/openvswitch-buildroot/usr/share/man/man5/ovsdb.*
	error: File not found by glob:
	/usr/src/tmp/openvswitch-buildroot/usr/share/man/man7/ovsdb-server.*
	error: File not found by glob:
	/usr/src/tmp/openvswitch-buildroot/usr/share/man/man7/ovsdb.*
	error: File not found by glob:
	/usr/src/tmp/openvswitch-buildroot/usr/share/man/man8/ovs-ctl.*
	error: File not found by glob:
	/usr/src/tmp/openvswitch-buildroot/usr/share/man/man8/ovs-appctl.*
	error: File not found by glob:
	/usr/src/tmp/openvswitch-buildroot/usr/share/man/man8/ovs-pki.*
	Executing(%doc): /bin/sh -e /usr/src/tmp/rpm-tmp.95513

perl-Time-Format_XS-1.03-alt5
	t/func.t ...... ok
	#   Failed test 'm test: Hour:'
	#   at t/iso8601.t line 176.
	--
	t/iso8601.t (Wstat: 256 Tests: 231 Failed: 1)
	Failed test:  123
	Non-zero exit status: 1
	--
	Result: FAIL
	Failed 1/4 test programs. 1/414 subtests failed.
	make: *** [Makefile:959: test_dynamic] Error 255

pytables-1:3.6.1-alt2
	Selecting python3-module-setuptools for 'python3-module-distribute'
	E: Couldn't find package python3-module-numexpr-tests
	hsh-install: Failed to calculate package file list.

python-module-argcomplete-1.9.4-alt2
	rpm-build-python3 is already the newest version.
	E: Couldn't find package python-module-pexpect
	hsh-install: Failed to calculate package file list.

python-module-cligj-0.5.0-alt1
	Selecting python3-dev for 'python3-devel'
	E: Couldn't find package python3-module-click-tests
	hsh-install: Failed to calculate package file list.

python-module-mercantile-0.10.0-alt1.1
	Selecting python3-dev for 'python3-devel'
	E: Couldn't find package python3-module-click-tests
	hsh-install: Failed to calculate package file list.

python-module-oauth2client-4.1.3-alt3
	==================================== ERRORS ====================================
	______________ ERROR collecting tests/contrib/test_flask_util.py _______________
	ImportError while importing test module
	'/usr/src/RPM/BUILD/python-module-oauth2client-4.1.3/tests/contrib/test_flask_util.py'.
	--
	import flask
	E   ImportError: No module named flask
	=============================== warnings summary ===============================

python3-module-click-plugins-1.0.2-alt3
	rpm-build-python3 is already the newest version.
	E: Couldn't find package python3-module-click-tests
	hsh-install: Failed to calculate package file list.

python3-module-numdifftools-0.9.12-alt2.git20150828.1
	+ find ./ -type f -name '*.py' -exec 2to3 -w -n '{}' +
	find: '2to3': No such file or directory

python3-module-rasterio-1.1.8-alt1
	python3-base is already the newest version.
	E: Couldn't find package python3-module-click-tests
	hsh-install: Failed to calculate package file list.

python3-module-scikit-image-0.17.2-alt2
	+ install -pm644 /usr/share/python-sphinx/objects.inv doc/
	install: cannot stat '/usr/share/python-sphinx/objects.inv': No such file or directory

python3-module-virtualenv-20.1.0-alt1
	SKIPPED [1] tests/unit/activation/conftest.py:249: Csh(
	version=FileNotFoundError(2, 'No such file or directory'),
	creator=CPython3Posix(dest=/usr/src/tmp/pytest-of-builder/pytest-0/popen-gw7/activation-tester-env0/e-$
	èрт🚒♞中片-j, clear=False, global=False),
	interpreter=PythonInfo(spec=CPython3.8.6.final.0-32, system=/usr/bin/python3.8,
	exe=/usr/src/RPM/BUILD/python3-module-virtualenv-20.1.0/.tox/py3/bin/python,
	platform=linux, version='3.8.6 (default, Oct  2 2020, 00:06:33) \n[GCC 9.3.1 20200518
	(ALT Sisyphus 9.3.1-alt1)]', encoding_fs_io=utf-8-utf-8)) is not available due [Errno 2]
	No such file or directory: 'csh'
	SKIPPED [1] tests/unit/activation/conftest.py:249: Fish(
	version=FileNotFoundError(2, 'No such file or directory'),
	creator=CPython3Posix(dest=/usr/src/tmp/pytest-of-builder/pytest-0/popen-gw0/activation-tester-env0/e-$
	èрт🚒♞中片-j, clear=False, global=False),
	interpreter=PythonInfo(spec=CPython3.8.6.final.0-32, system=/usr/bin/python3.8,
	exe=/usr/src/RPM/BUILD/python3-module-virtualenv-20.1.0/.tox/py3/bin/python,
	platform=linux, version='3.8.6 (default, Oct  2 2020, 00:06:33) \n[GCC 9.3.1 20200518
	(ALT Sisyphus 9.3.1-alt1)]', encoding_fs_io=utf-8-utf-8)) is not available due [Errno 2]
	No such file or directory: 'fish'
	SKIPPED [2] tests/unit/create/test_creator.py:454: we rewrite sys.path only on PY2
	--
	SKIPPED [1] tests/unit/activation/conftest.py:249: Fish(
	version=FileNotFoundError(2, 'No such file or directory'),
	creator=CPython3Posix(dest=/usr/src/tmp/pytest-of-builder/pytest-0/popen-gw1/activation-tester-env0/e-$
	èрт🚒♞中片-j, clear=False, global=False),
	interpreter=PythonInfo(spec=CPython3.8.6.final.0-32, system=/usr/bin/python3.8,
	exe=/usr/src/RPM/BUILD/python3-module-virtualenv-20.1.0/.tox/py3/bin/python,
	platform=linux, version='3.8.6 (default, Oct  2 2020, 00:06:33) \n[GCC 9.3.1 20200518
	(ALT Sisyphus 9.3.1-alt1)]', encoding_fs_io=utf-8-utf-8)) is not available due [Errno 2]
	No such file or directory: 'fish'
	SKIPPED [1] tests/unit/activation/conftest.py:249: Csh(
	version=FileNotFoundError(2, 'No such file or directory'),
	creator=CPython3Posix(dest=/usr/src/tmp/pytest-of-builder/pytest-0/popen-gw0/activation-tester-env1/e-$
	èрт🚒♞中片-j, clear=False, global=False),
	interpreter=PythonInfo(spec=CPython3.8.6.final.0-32, system=/usr/bin/python3.8,
	exe=/usr/src/RPM/BUILD/python3-module-virtualenv-20.1.0/.tox/py3/bin/python,
	platform=linux, version='3.8.6 (default, Oct  2 2020, 00:06:33) \n[GCC 9.3.1 20200518
	(ALT Sisyphus 9.3.1-alt1)]', encoding_fs_io=utf-8-utf-8)) is not available due [Errno 2]
	No such file or directory: 'csh'
	SKIPPED [2] tests/conftest.py:344: could not find 2
	SKIPPED [1] tests/unit/activation/conftest.py:249: PowerShell(
	version=FileNotFoundError(2, 'No such file or directory'),
	creator=CPython3Posix(dest=/usr/src/tmp/pytest-of-builder/pytest-0/popen-gw7/activation-tester-env2/e-$
	èрт🚒♞中片-j, clear=False, global=False),
	interpreter=PythonInfo(spec=CPython3.8.6.final.0-32, system=/usr/bin/python3.8,
	exe=/usr/src/RPM/BUILD/python3-module-virtualenv-20.1.0/.tox/py3/bin/python,
	platform=linux, version='3.8.6 (default, Oct  2 2020, 00:06:33) \n[GCC 9.3.1 20200518
	(ALT Sisyphus 9.3.1-alt1)]', encoding_fs_io=utf-8-utf-8)) is not available due [Errno 2]
	No such file or directory: 'pwsh'
	SKIPPED [2] tests/integration/test_zipapp.py:100: Requires internet connection

qtiplot-0.9.8.9-alt9.svn20120124
	from /usr/include/qt4/QtGui/QMainWindow:1,
	from src/core/ApplicationWindow.h:33,
	from src/core/ApplicationWindow.cpp:31:
	/usr/include/qt4/QtCore/qlist.h:239:16: note: because
	'QList<QMdiSubWindow*>::const_iterator' has user-provided
	'QList<T>::const_iterator::const_iterator(const QList<T>::const_iterator&) [with T =
	QMdiSubWindow*]'
	239 |	      inline const_iterator(const const_iterator &o): i(o.i) {}
	src/core/ApplicationWindow.cpp: In member function 'void
	ApplicationWindow::createActions()':
	src/core/ApplicationWindow.cpp:13681:6: note: variable tracking size limit exceeded with
	'-fvar-tracking-assignments', retrying without
	13681 | void ApplicationWindow::createActions()
	make[1]: Leaving directory '/usr/src/RPM/BUILD/qtiplot-0.9.8.9/qtiplot'
	make: *** [Makefile:154: sub-qtiplot-make_default] Error 2

	12 error logs REMOVED from the list
chromium-86.0.4240.111-alt1
chromium-gost-86.0.4240.111-alt1
custodia-0.6.0-alt6
dpkt-1.9.1-alt1
flvtool++-1.2.1-alt1
hypre-2.15.1-alt2
python-module-affinegap-1.10-alt2.1.1
python-module-networkx-2:2.2-alt4
python-module-pexpect-4.7.0-alt1
python-module-scipy-1.2.0-alt7
python3-module-jsonrpcclient-2.5.2-alt2
pywinery-0.3.2-alt2

Total 74 error logs.


Sisyphus-cybertalk