[cyber] I: Sisyphus-20201102 i586 beehive_status: +8 -17 (83)

ALT beekeeper hiver altlinux.org
2 16:06:42 MSK 2020


	8 NEW error logs

automake_1.11-1.11.6-alt9
	checking for upc... no
	configure: error: no Unified Parallel C compiler was found
	+ exit_status=77
	--
	+ exit 77
	2 of 878 tests failed
	(73 tests were not run)

dopewars-1.5.12-alt1_20.1033svn
	/bin/sh ../../libtool --mode=link i586-alt-linux-gcc  -pipe -frecord-gcc-switches -Wall -g
	-O2 -march=i586 -mtune=generic -Wall  -o libsound_sdl.la -rpath /usr/lib -lSDL -lpthread
	-lSDL_mixer sound_sdl.lo  -lglib-2.0
	libtool: link: rm -fr  .libs/libsound_sdl.a
	libtool: link: i586-alt-linux-gcc -shared  -fPIC -DPIC	.libs/sound_sdl.o   -lSDL
	-lpthread -lSDL_mixer -lglib-2.0  -g -O2 -march=i586 -mtune=generic   -Wl,-soname
	-Wl,libsound_sdl.so.0 -o .libs/libsound_sdl.so.0.0.0
	libtool: link: (cd ".libs" && rm -f "libsound_sdl.so.0" && ln -s "libsound_sdl.so.0.0.0"
	"libsound_sdl.so.0")
	libtool: link: (cd ".libs" && rm -f "libsound_sdl.so" && ln -s "libsound_sdl.so.0.0.0"
	"libsound_sdl.so")
	libtool: link: ( cd ".libs" && rm -f "libsound_sdl.la" && ln -s "../libsound_sdl.la"
	"libsound_sdl.la" )
	make[3]: Leaving directory '/usr/src/RPM/BUILD/dopewars/src/plugins'
	make[2]: *** [Makefile:574: all-recursive] Error 1
	make[1]: *** [Makefile:476: all-recursive] Error 1
	make: *** [Makefile:404: all] Error 2

ghc8.6.4-sha-1.6.4.4-alt1
	+ ./Setup makefile -f cabal-rpm.mk
	unrecognised command: makefile (try --help)
	+ ./Setup build
	Preprocessing library for SHA-1.6.4.4..
	Building library for SHA-1.6.4.4..
	[1 of 1] Compiling Data.Digest.Pure.SHA ( src/Data/Digest/Pure/SHA.hs,
	dist/build/Data/Digest/Pure/SHA.o )
	ghc: out of memory (requested 1048576 bytes)
	error: Bad exit status from /usr/src/tmp/rpm-tmp.6530 (%build)
	RPM build errors:
	File /usr/src/RPM/SOURCES/ghc8.6.4-sha-1.6.4.4-alt1.patch is smaller than 8 bytes

hedgewars-1.0.0-alt2
	make[2]: Leaving directory '/usr/src/RPM/BUILD/hedgewars-1.0.0'
	make[2]: Entering directory '/usr/src/RPM/BUILD/hedgewars-1.0.0'
	[100%] Linking CXX executable ../bin/hedgewars
	cd /usr/src/RPM/BUILD/hedgewars-1.0.0/QTfrontend && /usr/bin/cmake -E cmake_link_script
	CMakeFiles/hedgewars.dir/link.txt --verbose=true
	/usr/bin/clang -pipe -Wall -g -O2 -march=i586 -mtune=generic -fPIC
	-fstack-protector-all -fstack-protector -fvisibility=hidden -Wall -pipe
	-O2 -DNDEBUG -O2  -Wl,-znoexecstack -Wl,-zorigin -Wl,-zrelro -Wl,-znow
	-Wl,--as-needed -rdynamic CMakeFiles/hedgewars.dir/model/GameStyleModel.cpp.o
	CMakeFiles/hedgewars.dir/model/HatModel.cpp.o CMakeFiles/hedgewars.dir/model/MapModel.cpp.o
	CMakeFiles/hedgewars.dir/model/ThemeFilterProxyModel.cpp.o
	CMakeFiles/hedgewars.dir/model/ThemeModel.cpp.o
	CMakeFiles/hedgewars.dir/model/gameSchemeModel.cpp.o
	CMakeFiles/hedgewars.dir/model/netserverslist.cpp.o
	CMakeFiles/hedgewars.dir/model/playerslistmodel.cpp.o
	CMakeFiles/hedgewars.dir/model/roomslistmodel.cpp.o
	CMakeFiles/hedgewars.dir/net/hwmap.cpp.o CMakeFiles/hedgewars.dir/net/hwmapoptimizer.cpp.o
	CMakeFiles/hedgewars.dir/net/netregister.cpp.o CMakeFiles/hedgewars.dir/net/netserver.cpp.o
	CMakeFiles/hedgewars.dir/net/netudpserver.cpp.o
	CMakeFiles/hedgewars.dir/net/netudpwidget.cpp.o
	CMakeFiles/hedgewars.dir/net/newnetclient.cpp.o CMakeFiles/hedgewars.dir/net/proto.cpp.o
	CMakeFiles/hedgewars.dir/net/recorder.cpp.o CMakeFiles/hedgewars.dir/net/tcpBase.cpp.o
	CMakeFiles/hedgewars.dir/ui/dialog/ask_quit.cpp.o
	CMakeFiles/hedgewars.dir/ui/dialog/bandialog.cpp.o
	CMakeFiles/hedgewars.dir/ui/dialog/input_ip.cpp.o
	CMakeFiles/hedgewars.dir/ui/dialog/input_password.cpp.o
	CMakeFiles/hedgewars.dir/ui/mouseoverfilter.cpp.o
	CMakeFiles/hedgewars.dir/ui/page/AbstractPage.cpp.o
	CMakeFiles/hedgewars.dir/ui/page/pageadmin.cpp.o
	CMakeFiles/hedgewars.dir/ui/page/pagecampaign.cpp.o
	CMakeFiles/hedgewars.dir/ui/page/pageconnecting.cpp.o
	CMakeFiles/hedgewars.dir/ui/page/pagedata.cpp.o
	CMakeFiles/hedgewars.dir/ui/page/pagedrawmap.cpp.o
	CMakeFiles/hedgewars.dir/ui/page/pageeditteam.cpp.o
	CMakeFiles/hedgewars.dir/ui/page/pagegamestats.cpp.o
	CMakeFiles/hedgewars.dir/ui/page/pageinfo.cpp.o
	CMakeFiles/hedgewars.dir/ui/page/pageingame.cpp.o
	CMakeFiles/hedgewars.dir/ui/page/pagemain.cpp.o
	CMakeFiles/hedgewars.dir/ui/page/pagemultiplayer.cpp.o
	CMakeFiles/hedgewars.dir/ui/page/pagenet.cpp.o
	CMakeFiles/hedgewars.dir/ui/page/pagenetgame.cpp.o
	CMakeFiles/hedgewars.dir/ui/page/pagenetserver.cpp.o
	CMakeFiles/hedgewars.dir/ui/page/pageoptions.cpp.o
	CMakeFiles/hedgewars.dir/ui/page/pageplayrecord.cpp.o
	CMakeFiles/hedgewars.dir/ui/page/pageroomslist.cpp.o
	CMakeFiles/hedgewars.dir/ui/page/pagescheme.cpp.o
	CMakeFiles/hedgewars.dir/ui/page/pageselectweapon.cpp.o
	CMakeFiles/hedgewars.dir/ui/page/pagesingleplayer.cpp.o
	CMakeFiles/hedgewars.dir/ui/page/pagetraining.cpp.o
	CMakeFiles/hedgewars.dir/ui/page/pagevideos.cpp.o
	CMakeFiles/hedgewars.dir/ui/widget/FreqSpinBox.cpp.o
	CMakeFiles/hedgewars.dir/ui/widget/HistoryLineEdit.cpp.o
	CMakeFiles/hedgewars.dir/ui/widget/MinesTimeSpinBox.cpp.o
	CMakeFiles/hedgewars.dir/ui/widget/SDTimeoutSpinBox.cpp.o
	CMakeFiles/hedgewars.dir/ui/widget/SmartLineEdit.cpp.o
	CMakeFiles/hedgewars.dir/ui/widget/SquareLabel.cpp.o
	CMakeFiles/hedgewars.dir/ui/widget/about.cpp.o
	CMakeFiles/hedgewars.dir/ui/widget/bgwidget.cpp.o
	CMakeFiles/hedgewars.dir/ui/widget/chatwidget.cpp.o
	CMakeFiles/hedgewars.dir/ui/widget/colorwidget.cpp.o
	CMakeFiles/hedgewars.dir/ui/widget/databrowser.cpp.o
	CMakeFiles/hedgewars.dir/ui/widget/drawmapwidget.cpp.o
	CMakeFiles/hedgewars.dir/ui/widget/feedbackdialog.cpp.o
	CMakeFiles/hedgewars.dir/ui/widget/fpsedit.cpp.o
	CMakeFiles/hedgewars.dir/ui/widget/frameTeam.cpp.o
	CMakeFiles/hedgewars.dir/ui/widget/gamecfgwidget.cpp.o
	CMakeFiles/hedgewars.dir/ui/widget/hatbutton.cpp.o
	CMakeFiles/hedgewars.dir/ui/widget/hatprompt.cpp.o
	CMakeFiles/hedgewars.dir/ui/widget/hedgehogerWidget.cpp.o
	CMakeFiles/hedgewars.dir/ui/widget/igbox.cpp.o
	CMakeFiles/hedgewars.dir/ui/widget/itemNum.cpp.o
	CMakeFiles/hedgewars.dir/ui/widget/keybinder.cpp.o
	CMakeFiles/hedgewars.dir/ui/widget/lineeditcursor.cpp.o
	CMakeFiles/hedgewars.dir/ui/widget/mapContainer.cpp.o
	CMakeFiles/hedgewars.dir/ui/widget/qpushbuttonwithsound.cpp.o
	CMakeFiles/hedgewars.dir/ui/widget/roomnameprompt.cpp.o
	CMakeFiles/hedgewars.dir/ui/widget/seedprompt.cpp.o
	CMakeFiles/hedgewars.dir/ui/widget/selectWeapon.cpp.o CMake
	make[2]: Leaving directory '/usr/src/RPM/BUILD/hedgewars-1.0.0'
	make[1]: Entering directory '/usr/src/RPM/BUILD/hedgewars-1.0.0'
	[100%] Built target hedgewars
	make[1]: Leaving directory '/usr/src/RPM/BUILD/hedgewars-1.0.0'
	make: *** [Makefile:182: all] Error 2

perl-podlinkcheck-15-alt2
	Result: FAIL
	Failed 1/2 test programs. 0/37 subtests failed.
	make: *** [Makefile:797: test_dynamic] Error 1

python3-module-virtualenv-20.1.0-alt1
	SKIPPED [1] tests/unit/activation/conftest.py:249: Csh(
	version=FileNotFoundError(2, 'No such file or directory'),
	creator=CPython3Posix(dest=/usr/src/tmp/pytest-of-builder/pytest-0/popen-gw4/activation-tester-env0/e-$
	èрт🚒♞中片-j, clear=False, global=False),
	interpreter=PythonInfo(spec=CPython3.8.6.final.0-32, system=/usr/bin/python3.8,
	exe=/usr/src/RPM/BUILD/python3-module-virtualenv-20.1.0/.tox/py3/bin/python,
	platform=linux, version='3.8.6 (default, Oct  2 2020, 00:06:33) \n[GCC 9.3.1 20200518
	(ALT Sisyphus 9.3.1-alt1)]', encoding_fs_io=utf-8-utf-8)) is not available due [Errno 2]
	No such file or directory: 'csh'
	SKIPPED [2] tests/unit/activation/conftest.py:246: BatchActivator not supported
	--
	SKIPPED [1] tests/unit/activation/conftest.py:249: Csh(
	version=FileNotFoundError(2, 'No such file or directory'),
	creator=CPython3Posix(dest=/usr/src/tmp/pytest-of-builder/pytest-0/popen-gw2/activation-tester-env0/e-$
	èрт🚒♞中片-j, clear=False, global=False),
	interpreter=PythonInfo(spec=CPython3.8.6.final.0-32, system=/usr/bin/python3.8,
	exe=/usr/src/RPM/BUILD/python3-module-virtualenv-20.1.0/.tox/py3/bin/python,
	platform=linux, version='3.8.6 (default, Oct  2 2020, 00:06:33) \n[GCC 9.3.1 20200518
	(ALT Sisyphus 9.3.1-alt1)]', encoding_fs_io=utf-8-utf-8)) is not available due [Errno 2]
	No such file or directory: 'csh'
	SKIPPED [1] tests/unit/test_util.py:19: subprocess patch only applied on Windows python2
	SKIPPED [1] tests/unit/activation/conftest.py:249: Fish(
	version=FileNotFoundError(2, 'No such file or directory'),
	creator=CPython3Posix(dest=/usr/src/tmp/pytest-of-builder/pytest-0/popen-gw4/activation-tester-env2/e-$
	èрт🚒♞中片-j, clear=False, global=False),
	interpreter=PythonInfo(spec=CPython3.8.6.final.0-32, system=/usr/bin/python3.8,
	exe=/usr/src/RPM/BUILD/python3-module-virtualenv-20.1.0/.tox/py3/bin/python,
	platform=linux, version='3.8.6 (default, Oct  2 2020, 00:06:33) \n[GCC 9.3.1 20200518
	(ALT Sisyphus 9.3.1-alt1)]', encoding_fs_io=utf-8-utf-8)) is not available due [Errno 2]
	No such file or directory: 'fish'
	SKIPPED [1] tests/unit/create/test_creator.py:281: python 2 only tests
	--
	SKIPPED [1] tests/unit/activation/conftest.py:249: Fish(
	version=FileNotFoundError(2, 'No such file or directory'),
	creator=CPython3Posix(dest=/usr/src/tmp/pytest-of-builder/pytest-0/popen-gw3/activation-tester-env0/e-$
	èрт🚒♞中片-j, clear=False, global=False),
	interpreter=PythonInfo(spec=CPython3.8.6.final.0-32, system=/usr/bin/python3.8,
	exe=/usr/src/RPM/BUILD/python3-module-virtualenv-20.1.0/.tox/py3/bin/python,
	platform=linux, version='3.8.6 (default, Oct  2 2020, 00:06:33) \n[GCC 9.3.1 20200518
	(ALT Sisyphus 9.3.1-alt1)]', encoding_fs_io=utf-8-utf-8)) is not available due [Errno 2]
	No such file or directory: 'fish'
	SKIPPED [2] tests/unit/create/test_creator.py:510: stdlib components without py files
	only possible on CPython2
	--
	SKIPPED [1] tests/unit/activation/conftest.py:249: PowerShell(
	version=FileNotFoundError(2, 'No such file or directory'),
	creator=CPython3Posix(dest=/usr/src/tmp/pytest-of-builder/pytest-0/popen-gw4/activation-tester-env2/e-$
	èрт🚒♞中片-j, clear=False, global=False),
	interpreter=PythonInfo(spec=CPython3.8.6.final.0-32, system=/usr/bin/python3.8,
	exe=/usr/src/RPM/BUILD/python3-module-virtualenv-20.1.0/.tox/py3/bin/python,
	platform=linux, version='3.8.6 (default, Oct  2 2020, 00:06:33) \n[GCC 9.3.1 20200518
	(ALT Sisyphus 9.3.1-alt1)]', encoding_fs_io=utf-8-utf-8)) is not available due [Errno 2]
	No such file or directory: 'pwsh'
	SKIPPED [1] tests/unit/activation/conftest.py:249: PowerShell(

sssd-2.4.0-alt1
	PASS: test_ad_subdom
	FAIL: test_ipa_subdom_server
	PASS: test_sssd_krb5_localauth_plugin
	--
	# SKIP:  2
	# XFAIL: 0
	# FAIL:  1
	# XPASS: 0
	# ERROR: 0
	.. contents:: :depth: 2
	FAIL: test_ipa_subdom_server
	[==========] Running 13 test(s).
	--
	[ RUN	   ] test_ipa_server_trust_oneway_init
	[  ERROR   ] --- test_ctx->ipa_ctx->server_mode->trusts
	[   LINE   ] --- src/tests/cmocka/test_ipa_subdomains_server.c:907: error: Failure!
	[  FAILED  ] test_ipa_server_trust_oneway_init
	[ RUN	   ] test_ipa_server_trust_init
	--
	[  PASSED  ] 12 test(s).
	[  FAILED  ] 1 test(s), listed below:
	[  FAILED  ] test_ipa_server_trust_oneway_init
	1 FAILED TEST(S)

transgui-5.18.0-alt2
	/usr/src/RPM/BUILD/transgui-5.18.0/vargrid.pas(1075,51) Заметка: (6058) Call to
	subroutine "operator :=(const source:AnsiString):Variant;" marked as inline is not inlined
	/usr/src/RPM/BUILD/transgui-5.18.0/vargrid.pas(1097,51) Заметка: (6058) Call
	to subroutine "operator :=(const source:Variant):UnicodeString;" marked as inline is
	not inlined
	/usr/src/RPM/BUILD/transgui-5.18.0/vargrid.pas(1437,39) Заметка: (6058) Call
	to subroutine "operator :=(const source:Variant):UnicodeString;" marked as inline is
	not inlined
	/usr/src/RPM/BUILD/transgui-5.18.0/vargrid.pas(1459,53) ЗамAn unhandled exception
	occurred at $08156803:
	EAccessViolation: Access violation
	$08156803
	$0857E319
	$08581647
	$0858264D
	$08065AA6

	17 error logs REMOVED from the list
SNNS-4.3-alt1.1.1.1
cilk-5.4.6-alt11
dino-0.1.0-alt2
fish-3.1.2-alt1
gnome-games-swell-foop-3.34.1-alt1
guile22-2.2.4-alt3
meschach-1.2-alt1.b.3
noise-5.0.5-alt1
python-module-Naked-1:0.1.31-alt1.1
python-module-bottleneck-1.2.1-alt2
python-module-geoalchemy2-0.4-alt1.1
python-module-skosprovider-0.5.0-alt1.git20141218.1.1.1
python-module-triangle-2017.04.29-alt1.1.1
python3-module-fiona-1.8.17-alt1
python3-module-piexif-1.0.13-alt2
sbcl-2.0.4-alt1
telegram-desktop-2.3.1-alt1

Total 83 error logs.


Sisyphus-cybertalk