[cyber] I: Sisyphus-20201102 x86_64 beehive_status: +5 -18 (79)

ALT beekeeper hiver altlinux.org
2 09:01:35 MSK 2020


	5 NEW error logs

dotnet-coreclr-3.1.6-alt1
	/usr/bin/ranlib libcee_wks.a
	make[2]: Leaving directory
	'/usr/src/RPM/BUILD/dotnet-coreclr-3.1.6/bin/obj/Linux.x64.Release'
	make[1]: Entering directory
	'/usr/src/RPM/BUILD/dotnet-coreclr-3.1.6/bin/obj/Linux.x64.Release'
	[ 40%] Built target cee_wks
	make[1]: Leaving directory
	'/usr/src/RPM/BUILD/dotnet-coreclr-3.1.6/bin/obj/Linux.x64.Release'
	make: *** [Makefile:149: all] Error 2
	+ '[' 2 '!=' 0 ']'
	+ echo 'Failed to build CoreCLR component.'
	Failed to build CoreCLR component.
	+ exit 1

libgupnp-igd-1.2.0-alt1
	Full log written to
	/usr/src/RPM/BUILD/gupnp-igd-1.2.0/x86_64-alt-linux/meson-logs/testlog.txt
	FAILED: meson-test
	/usr/bin/meson test --no-rebuild --print-errorlogs

perl-podlinkcheck-15-alt2
	Result: FAIL
	Failed 1/2 test programs. 0/37 subtests failed.
	make: *** [Makefile:797: test_dynamic] Error 1

python-module-pexpect-4.7.0-alt1
	+ command)
	E	    ValueError: Continuation prompt found - input was incomplete:
	E	    echo $HOME
	--
	=========================== short test summary info ============================
	FAILED tests/test_replwrap.py::REPLWrapTestCase::test_existing_spawn - ValueE...
	============ 1 failed, 230 passed, 13 warnings in 180.38s (0:03:00) ============

python3-module-virtualenv-20.1.0-alt1
	SKIPPED [1] tests/unit/activation/conftest.py:249: Csh(
	version=FileNotFoundError(2, 'No such file or directory'),
	creator=CPython3Posix(dest=/usr/src/tmp/pytest-of-builder/pytest-0/popen-gw7/activation-tester-env0/e-$
	èрт🚒♞中片-j, clear=False, global=False),
	interpreter=PythonInfo(spec=CPython3.8.6.final.0-64, system=/usr/bin/python3.8,
	exe=/usr/src/RPM/BUILD/python3-module-virtualenv-20.1.0/.tox/py3/bin/python,
	platform=linux, version='3.8.6 (default, Oct  2 2020, 00:06:33) \n[GCC 9.3.1 20200518
	(ALT Sisyphus 9.3.1-alt1)]', encoding_fs_io=utf-8-utf-8)) is not available due [Errno 2]
	No such file or directory: 'csh'
	SKIPPED [2] tests/unit/activation/conftest.py:246: BatchActivator not supported
	SKIPPED [1] tests/unit/activation/conftest.py:249: Fish(
	version=FileNotFoundError(2, 'No such file or directory'),
	creator=CPython3Posix(dest=/usr/src/tmp/pytest-of-builder/pytest-0/popen-gw3/activation-tester-env1/e-$
	èрт🚒♞中片-j, clear=False, global=False),
	interpreter=PythonInfo(spec=CPython3.8.6.final.0-64, system=/usr/bin/python3.8,
	exe=/usr/src/RPM/BUILD/python3-module-virtualenv-20.1.0/.tox/py3/bin/python,
	platform=linux, version='3.8.6 (default, Oct  2 2020, 00:06:33) \n[GCC 9.3.1 20200518
	(ALT Sisyphus 9.3.1-alt1)]', encoding_fs_io=utf-8-utf-8)) is not available due [Errno 2]
	No such file or directory: 'fish'
	SKIPPED [2] tests/unit/create/test_creator.py:510: stdlib components without py files
	only possible on CPython2
	--
	SKIPPED [1] tests/unit/activation/conftest.py:249: Csh(
	version=FileNotFoundError(2, 'No such file or directory'),
	creator=CPython3Posix(dest=/usr/src/tmp/pytest-of-builder/pytest-0/popen-gw0/activation-tester-env0/e-$
	èрт🚒♞中片-j, clear=False, global=False),
	interpreter=PythonInfo(spec=CPython3.8.6.final.0-64, system=/usr/bin/python3.8,
	exe=/usr/src/RPM/BUILD/python3-module-virtualenv-20.1.0/.tox/py3/bin/python,
	platform=linux, version='3.8.6 (default, Oct  2 2020, 00:06:33) \n[GCC 9.3.1 20200518
	(ALT Sisyphus 9.3.1-alt1)]', encoding_fs_io=utf-8-utf-8)) is not available due [Errno 2]
	No such file or directory: 'csh'
	SKIPPED [1] tests/unit/create/test_creator.py:376: OS does not have an altsep
	--
	SKIPPED [1] tests/unit/activation/conftest.py:249: Fish(
	version=FileNotFoundError(2, 'No such file or directory'),
	creator=CPython3Posix(dest=/usr/src/tmp/pytest-of-builder/pytest-0/popen-gw7/activation-tester-env1/e-$
	èрт🚒♞中片-j, clear=False, global=False),
	interpreter=PythonInfo(spec=CPython3.8.6.final.0-64, system=/usr/bin/python3.8,
	exe=/usr/src/RPM/BUILD/python3-module-virtualenv-20.1.0/.tox/py3/bin/python,
	platform=linux, version='3.8.6 (default, Oct  2 2020, 00:06:33) \n[GCC 9.3.1 20200518
	(ALT Sisyphus 9.3.1-alt1)]', encoding_fs_io=utf-8-utf-8)) is not available due [Errno 2]
	No such file or directory: 'fish'
	SKIPPED [1] tests/unit/discovery/windows/test_windows_pep514.py:14: no Windows registry
	--
	SKIPPED [1] tests/unit/activation/conftest.py:249: PowerShell(
	version=FileNotFoundError(2, 'No such file or directory'),
	creator=CPython3Posix(dest=/usr/src/tmp/pytest-of-builder/pytest-0/popen-gw6/activation-tester-env0/e-$
	èрт🚒♞中片-j, clear=False, global=False),
	interpreter=PythonInfo(spec=CPython3.8.6.final.0-64, system=/usr/bin/python3.8,
	exe=/usr/src/RPM/BUILD/python3-module-virtualenv-20.1.0/.tox/py3/bin/python,
	platform=linux, version='3.8.6 (default, Oct  2 2020, 00:06:33) \n[GCC 9.3.1 20200518
	(ALT Sisyphus 9.3.1-alt1)]', encoding_fs_io=utf-8-utf-8)) is not available due [Errno 2]
	No such file or directory: 'pwsh'
	SKIPPED [1] tests/unit/activation/conftest.py:249: PowerShell(

	18 error logs REMOVED from the list
automake_1.11-1.11.6-alt9
dietlibc-0.33-alt3
dino-0.1.0-alt2
gnome-games-swell-foop-3.34.1-alt1
libopenh264-2.1.1-alt1
neko-2.2.0-alt4.gitb68336c
noise-5.0.5-alt1
perl-Net-SIP-0.823-alt1
perl-Server-Starter-0.35-alt1.1
python-module-Naked-1:0.1.31-alt1.1
python-module-bottleneck-1.2.1-alt2
python-module-geoalchemy2-0.4-alt1.1
python-module-skosprovider-0.5.0-alt1.git20141218.1.1.1
python-module-triangle-2017.04.29-alt1.1.1
python3-module-fiona-1.8.17-alt1
python3-module-piexif-1.0.13-alt2
telegram-desktop-2.3.1-alt1
xtux-20030306-alt5.qa1

Total 79 error logs.


Sisyphus-cybertalk