[cyber] I: p9-20200607 i586 beehive_status: +8 -30 (102)
ALT beekeeper
hiver на altlinux.org
Вс Июн 7 18:05:17 MSK 2020
8 NEW error logs
SNNS-4.3-alt1.1.1.1
ar rc lib3d.a net_analyzer.o d3_xUtils.o d3_global.o d3_anageo.o d3_shade.o d3_lists.o
d3_point.o d3_dither.o d3_zgraph.o d3_fonts.o d3_graph.o d3_draw.o d3_disp.o d3_move.o
d3_zValue.o d3_setup.o d3_units.o d3_links.o d3_model.o d3_project.o d3_light.o
d3_pannels.o d3_main.o bn_bignet.o bn_basics.o bn_art1.o bn_art2.o bn_artmap.o
bn_TD_bignet.o bn_kohonen.o bn_assoz.o o_graph.o bn_JordElm.o ui_class.o bn_bighop.o
ranlib lib3d.a
make[1]: Leaving directory '/usr/src/RPM/BUILD/SNNSv4.3/xgui/sources'
make[1]: Entering directory '/usr/src/RPM/BUILD/SNNSv4.3/xgui/sources'
i586-alt-linux-gcc libxgui1.a libxgui2.a lib3d.a \
-lXaw3d -lXmu -lXt -lXext -lSM -lICE -lX11 \
../../kernel/sources/libkernel.a ../../kernel/sources/libfunc.a -lm -lfl -o xgui
/usr/bin/ld.default: libxgui1.a(ui_controlP.o): in function `ui_rem_performPrunInit':
/usr/src/RPM/BUILD/SNNSv4.3/xgui/sources/ui_controlP.c:1191: warning: the use of
`tempnam' is dangerous, better use `mkstemp'
make[1]: Leaving directory '/usr/src/RPM/BUILD/SNNSv4.3/xgui/sources'
altlinux-freedesktop-menu-0.67-alt1
+ j=altlinux-webdevelopment.directory
+ grep altlinux-webdevelopment.directory ignore.list
+ grep 'Name\[ru\]=' desktop-directories/altlinux-webdevelopment.directory
+ for i in desktop-directories/*.directory
++ basename desktop-directories/altlinux-xfce.directory
+ j=altlinux-xfce.directory
+ grep altlinux-xfce.directory ignore.list
+ rm ignore.list
+ '[' 0 -gt 0 ']'
+ exit 1
libsmi-0.5.0-alt1.svn1841
if (tmpAttribute =
parser-sming.y:21: error: unterminated #ifdef
#ifdef BACKEND_SMING
parser-sming.c:3149:10: error: expected ';' at end of input
break;
parser-sming.c:3149:5: error: expected declaration or statement at end of input
break;
parser-sming.c:3149:5: error: expected declaration or statement at end of input
parser-sming.c:2063:5: error: label 'yyerrlab' used but not defined
goto yyerrlab;
parser-sming.c:1987:5: error: label 'yyacceptlab' used but not defined
YYACCEPT;
parser-sming.y:681:5: error: label 'yyabortlab' used but not defined
YYABORT;
parser-sming.c:1964:11: error: label 'yyexhaustedlab' used but not defined
goto yyexhaustedlab;
openqa-4.5.1528009330.e68ebe2b-alt3
[2020-06-07 11:13:04.25970] [2615113] [debug] [Job #36] Finished
# Failed test 'job enqueued'
# at ./t/25-cache-service.t line 533.
# Looks like you failed 1 test of 3.
# Failed test 'Test Minion Sync task'
# at ./t/25-cache-service.t line 541.
--
./t/25-cache-service.t (Wstat: 65280 Tests: 19 Failed: 1)
Failed test: 18
Non-zero exit status: 255
python-module-pytest-cov-2.7.1-alt1
Б°■ OK py27 in 5 minutes, 5.6 seconds
hasher-priv: master: idle time limit (3600 seconds) exceeded
sway-1:1.4-alt1.1.p9
Selecting libpam0-devel for 'libpam-devel'
E: Couldn't find package libwlc0-devel
hsh-install: Failed to calculate package file list.
testng-0:6.14.3-alt1_2jpp8
StackTrace:
java.lang.AssertionError: Expected 20 test method start event logs to be in a
block of methods executing in parallel. Found an event log of a different type
in the block being processed: [EventLog{Event: LISTENER_TEST_METHOD_START,
Suite: TestSuiteB, Test: TestSuiteB-ThreeTestClassTest, Class:
test.thread.parallelization.sample.TestClassBFourMethodsWithNoDepsSample, Class
instance hash code: 1049026, Method name: testMethodA, Time of event: 2020-06-07
13:44:23.905, Thread ID: 5658}, EventLog{Event: LISTENER_TEST_METHOD_START,
Suite: TestSuiteB, Test: TestSuiteB-ThreeTestClassTest, Class:
test.thread.parallelization.sample.TestClassBFourMethodsWithNoDepsSample, Class
instance hash code: 21351711, Method name: testMethodA, Time of event: 2020-06-07
13:44:23.933, Thread ID: 5659}, EventLog{Event: LISTENER_TEST_METHOD_START,
Suite: TestSuiteB, Test: TestSuiteB-ThreeTestClassTest, Class:
test.thread.parallelization.sample.TestClassBFourMethodsWithNoDepsSample,
Class instance hash code: 32353942, Method name: testMethodA, Time
of event: 2020-06-07 13:44:23.961, Thread ID: 5660}, EventLog{Event:
LISTENER_TEST_METHOD_START, Suite: TestSuiteB, Test: TestSuiteB-ThreeTestClassTest,
Class: test.thread.parallelization.sample.TestClassBFourMethodsWithNoDepsSample, Class
instance hash code: 9197644, Method name: testMethodA, Time of event: 2020-06-07
13:44:23.989, Thread ID: 5661}, EventLog{Event: LISTENER_TEST_METHOD_START,
Suite: TestSuiteB, Test: TestSuiteB-ThreeTestClassTest, Class:
test.thread.parallelization.sample.TestClassBFourMethodsWithNoDepsSample, Class
instance hash code: 9288967, Method name: testMethodA, Time of event: 2020-06-07
13:44:24.018, Thread ID: 5662}, EventLog{Event: LISTENER_TEST_METHOD_START,
Suite: TestSuiteB, Test: TestSuiteB-ThreeTestClassTest, Class:
test.thread.parallelization.sample.TestClassBFourMethodsWithNoDepsSample, Class
instance hash code: 1049026, Method name: testMethodB, Time of event: 2020-06-07
13:44:24.046, Thread ID: 5663}, EventLog{Event: LISTENER_TEST_METHOD_START,
Suite: TestSuiteB, Test: TestSuiteB-ThreeTestClassTest, Class:
test.thread.parallelization.sample.TestClassBFourMethodsWithNoDepsSample, Class
instance hash code: 21351711, Method name: testMethodB, Time of event: 2020-06-07
13:44:24.074, Thread ID: 5664}, EventLog{Event: LISTENER_TEST_METHOD_START,
Suite: TestSuiteB, Test: TestSuiteB-ThreeTestClassTest, Class:
test.thread.parallelization.sample.TestClassBFourMethodsWithNoDepsSample,
Class instance hash code: 32353942, Method name: testMethodB, Time
of event: 2020-06-07 13:44:24.102, Thread ID: 5665}, EventLog{Event:
LISTENER_TEST_METHOD_START, Suite: TestSuiteB, Test: TestSuiteB-ThreeTestClassTest,
Class: test.thread.parallelization.sample.TestClassBFourMethodsWithNoDepsSample, Class
instance hash code: 9197644, Method name: testMethodB, Time of event: 2020-06-07
13:44:24.130, Thread ID: 5666}, EventLog{Event: LISTENER_TEST_METHOD_START,
Suite: TestSuiteB, Test: TestSuiteB-ThreeTestClassTest, Class:
test.thread.parallelization.sample.TestClassBFourMethodsWithNoDepsSample, Class
instance hash code: 9288967, Method name: testMethodB, Time of event: 2020-06-07
13:44:24.158, Thread ID: 5667}, EventLog{Event: LISTENER_TEST_METHOD_START,
Suite: TestSuiteB, Test: TestSuiteB-ThreeTestClassTest, Class:
test.thread.parallelization.sample.TestClassBFourMethodsWithNoDepsSample, Class
instance hash code: 1049026, Method name: testMethodC, Time of event: 2020-06-07
13:44:24.186, Thread ID: 5668}, EventLog{Event: LISTENER_TEST_METHOD_START,
Suite: TestSuiteB, Test: TestSuiteB-ThreeTestClassTest, Class:
test.thread.parallelization.sample.TestClassBFourMethodsWithNoDepsSample,
Class instance hash code: 21351711, Method name: testMethodC, Time
of event: 2020-06-07 13:44:24.215, Thread ID: 5669}, EventLog{Event:
LISTENER_TEST_METHOD_START, Suite: TestSuiteB, Test: TestSuiteB-ThreeTestClassTest, Class:
test.thread.parallelization.sample.TestClassBFourMethodsWithNoDepsSample, Class instance
hash code: 32353942, Method name: testMethodC, Time of event: 2020-06-07 13:44:24.243,
Thread ID: 5670}, E
at
test.thread.parallelization.BaseParallelizationTest.verifyEventTypeForEventsLogs(BaseParallelizationTest.java:100)
--
[ERROR]
verifyThatTestMethodsRunInParallelThreads(test.thread.parallelization.ParallelByMethodsTestCase6Scenario1)
Time elapsed: 1.162 s <<< FAILURE!
java.lang.AssertionError: Expected 20 test method start event logs to be in a
block of methods executing in parallel. Found an event log of a different type
in the block being processed: [EventLog{Event: LISTENER_TEST_METHOD_START,
Suite: TestSuiteB, Test: TestSuiteB-ThreeTestClassTest, Class:
test.thread.parallelization.sample.TestClassBFourMethodsWithNoDepsSample, Class
instance hash code: 1049026, Method name: testMethodA, Time of event: 2020-06-07
13:44:23.905, Thread ID: 5658}, EventLog{Event: LISTENER_TEST_METHOD_START,
Suite: TestSuiteB, Test: TestSuiteB-ThreeTestClassTest, Class:
test.thread.parallelization.sample.TestClassBFourMethodsWithNoDepsSample, Class
instance hash code: 21351711, Method name: testMethodA, Time of event: 2020-06-07
13:44:23.933, Thread ID: 5659}, EventLog{Event: LISTENER_TEST_METHOD_START,
Suite: TestSuiteB, Test: TestSuiteB-ThreeTestClassTest, Class:
test.thread.parallelization.sample.TestClassBFourMethodsWithNoDepsSample,
Class instance hash code: 32353942, Method name: testMethodA, Time
of event: 2020-06-07 13:44:23.961, Thread ID: 5660}, EventLog{Event:
LISTENER_TEST_METHOD_START, Suite: TestSuiteB, Test: TestSuiteB-ThreeTestClassTest,
Class: test.thread.parallelization.sample.TestClassBFourMethodsWithNoDepsSample, Class
instance hash code: 9197644, Method name: testMethodA, Time of event: 2020-06-07
13:44:23.989, Thread ID: 5661}, EventLog{Event: LISTENER_TEST_METHOD_START,
Suite: TestSuiteB, Test: TestSuiteB-ThreeTestClassTest, Class:
test.thread.parallelization.sample.TestClassBFourMethodsWithNoDepsSample, Class
instance hash code: 9288967, Method name: testMethodA, Time of event: 2020-06-07
13:44:24.018, Thread ID: 5662}, EventLog{Event: LISTENER_TEST_METHOD_START,
Suite: TestSuiteB, Test: TestSuiteB-ThreeTestClassTest, Class:
test.thread.parallelization.sample.TestClassBFourMethodsWithNoDepsSample, Class
instance hash code: 1049026, Method name: testMethodB, Time of event: 2020-06-07
13:44:24.046, Thread ID: 5663}, EventLog{Event: LISTENER_TEST_METHOD_START,
Suite: TestSuiteB, Test: TestSuiteB-ThreeTestClassTest, Class:
test.thread.parallelization.sample.TestClassBFourMethodsWithNoDepsSample, Class
instance hash code: 21351711, Method name: testMethodB, Time of event: 2020-06-07
13:44:24.074, Thread ID: 5664}, EventLog{Event: LISTENER_TEST_METHOD_START,
Suite: TestSuiteB, Test: TestSuiteB-ThreeTestClassTest, Class:
test.thread.parallelization.sample.TestClassBFourMethodsWithNoDepsSample,
Class instance hash code: 32353942, Method name: testMethodB, Time
of event: 2020-06-07 13:44:24.102, Thread ID: 5665}, EventLog{Event:
LISTENER_TEST_METHOD_START, Suite: TestSuiteB, Test: TestSuiteB-ThreeTestClassTest,
Class: test.thread.parallelization.sample.TestClassBFourMethodsWithNoDepsSample, Class
instance hash code: 9197644, Method name: testMethodB, Time of event: 2020-06-07
13:44:24.130, Thread ID: 5666}, EventLog{Event: LISTENER_TEST_METHOD_START,
Suite: TestSuiteB, Test: TestSuiteB-ThreeTestClassTest, Class:
test.thread.parallelization.sample.TestClassBFourMethodsWithNoDepsSample, Class
instance hash code: 9288967, Method name: testMethodB, Time of event: 2020-06-07
13:44:24.158, Thread ID: 5667}, EventLog{Event: LISTENER_TEST_METHOD_START,
Suite: TestSuiteB, Test: TestSuiteB-ThreeTestClassTest, Class:
test.thread.parallelization.sample.TestClassBFourMethodsWithNoDepsSample, Class
instance hash code: 1049026, Method name: testMethodC, Time of event: 2020-06-07
13:44:24.186, Thread ID: 5668}, EventLog{Event: LISTENER_TEST_METHOD_START,
Suite: TestSuiteB, Test: TestSuiteB-ThreeTestClassTest, Class:
test.thread.parallelization.sample.TestClassBFourMethodsWithNoDepsSample,
Class instance hash code: 21351711, Method name: testMethodC, Time
of event: 2020-06-07 13:44:24.215, Thread ID: 5669}, EventLog{Event:
LISTENER_TEST_METHOD_START, Suite: TestSuiteB, Test: TestSuiteB-ThreeTestClassTest, Class:
test.thread.parallelization.sample.TestClassBFourMethodsWithNoDepsSample, Class instance
hash code: 32353942, Method name: testMethodC, Time of event: 2020-06-07 13:44:24.243,
Thread ID: 5670}, Ev
at
test.thread.parallelization.ParallelByMethodsTestCase6Scenario1.verifyThatTestMethodsRunInParallelThreads(ParallelByMethodsTestCase6Scenario1.java:595)
virtualgl-2.6.1-alt1
/usr/src/RPM/BUILD/virtualgl-2.6.1/server/faker-sym.h: In function 'int
_glXGetTransparentIndexSUN(Display*, Window, Window, long int*)':
/usr/src/RPM/BUILD/virtualgl-2.6.1/server/faker-sym.h:556:46: error: comparison between
distinct pointer types '_glXGetTransparentIndexSUNType' {aka 'int (*)(_XDisplay*, long
unsigned int, long unsigned int, long int*)'} and 'int (*)(Display*, Window, Window,
long unsigned int*)' {aka 'int (*)(_XDisplay*, long unsigned int, long unsigned int,
long unsigned int*)'} lacks a cast [-fpermissive]
Window, underlay, long *, transparentIndex, glXGetTransparentIndexSUN);
--
/usr/src/RPM/BUILD/virtualgl-2.6.1/server/faker-sym.h: In function 'int
_glXGetTransparentIndexSUN(Display*, Window, Window, long int*)':
/usr/src/RPM/BUILD/virtualgl-2.6.1/server/faker-sym.h:556:46: error: comparison between
distinct pointer types '_glXGetTransparentIndexSUNType' {aka 'int (*)(_XDisplay*, long
unsigned int, long unsigned int, long int*)'} and 'int (*)(Display*, Window, Window,
long unsigned int*)' {aka 'int (*)(_XDisplay*, long unsigned int, long unsigned int,
long unsigned int*)'} lacks a cast [-fpermissive]
Window, underlay, long *, transparentIndex, glXGetTransparentIndexSUN);
--
/usr/src/RPM/BUILD/virtualgl-2.6.1/server/faker-sym.h: In function 'int
_glXGetTransparentIndexSUN(Display*, Window, Window, long int*)':
/usr/src/RPM/BUILD/virtualgl-2.6.1/server/faker-sym.h:556:46: error: comparison between
distinct pointer types '_glXGetTransparentIndexSUNType' {aka 'int (*)(_XDisplay*, long
unsigned int, long unsigned int, long int*)'} and 'int (*)(Display*, Window, Window,
long unsigned int*)' {aka 'int (*)(_XDisplay*, long unsigned int, long unsigned int,
long unsigned int*)'} lacks a cast [-fpermissive]
Window, underlay, long *, transparentIndex, glXGetTransparentIndexSUN);
30 error logs REMOVED from the list
ZendFramework-1.11.7-alt1
apache-commons-ognl-3.0.2-alt2_15.20120313svn1102435jpp8
arpack-96-alt11
boomaga-3.0.0-alt1
compiz-0.9.14.1-alt1
curl-7.65.0-alt1
erlang-triq-1.3.0-alt1
gear-2.2.0-alt1
gromacs-4.0.7-alt8
gtkhtml3-3.32.2-alt4
iputils-20190709-alt1
jed-2:0.99.19-alt2.qa2.1
jetty-alpn-8.1.11-alt1_3.v20170118jpp8
kde5-kdb-3.2.0-alt1
kde5-konversation-1.7.5-alt4
kde5-kpat-18.04.3-alt2
kdevelop5-5.3.2-alt1
kexi-3.2.0-alt1
kmymoney-5.0.4-alt1
laptop-mode-tools-1.72.2-alt1
libgwenhywfar-4.20.1-alt1.1
mpb-1.5-alt3
perl-Coro-1:6.540-alt1_1
perl-HTTP-Proxy-0.304-alt2
pg_rman-1.3.8-alt1
python-module-flake8-3.7.7-alt1
python-module-setuptools-1:40.8.0-alt2
qt3-3.3.8d-alt12
tuxvsclippy-0.2.5-alt3.1.qa1
xtux-20030306-alt5.qa1
Total 102 error logs.
Подробная информация о списке рассылки Sisyphus-cybertalk