[cyber] I: Sisyphus-20200107 x86_64 beehive_status: +7 -6 (597)

ALT beekeeper hiver на altlinux.org
Вт Янв 7 09:59:38 MSK 2020

	7 NEW error logs

	[ERROR] Please refer to /usr/src/RPM/BUILD/mockito-2.23.9/target/surefire-reports for
	the individual test results.
	[ERROR] Please refer to dump files (if any exist) [date]-jvmRun[N].dump, [date].dumpstream
	and [date]-jvmRun[N].dumpstream.
	[ERROR] -> [Help 1]
	[ERROR] To see the full stack trace of the errors, re-run Maven with the -e switch.
	[ERROR] Re-run Maven using the -X switch to enable full debug logging.
	[ERROR] For more information about the errors and possible solutions, please read the
	following articles:
	[ERROR] [Help 1] http://cwiki.apache.org/confluence/display/MAVEN/MojoFailureException

	[116/1437] Compiling C object
	'clutter/clutter/50bf134@@mutter-clutter-5 на sha/clutter-scriptable.c.o'.
	FAILED: clutter/clutter/50bf134@@mutter-clutter-5 на sha/clutter-scriptable.c.o
	cc -Iclutter/clutter/50bf134@@mutter-clutter-5 на sha -Iclutter/clutter -I../clutter/clutter
	-Iclutter -I../clutter -Icogl -I../cogl -Icogl/cogl -I../cogl/cogl -I/usr/include/atk-1.0
	-I/usr/include/glib-2.0 -I/usr/lib64/glib-2.0/include -I/usr/include/cairo
	-I/usr/include/freetype2 -I/usr/include/harfbuzz -I/usr/include/libpng16
	-I/usr/include/gio-unix-2.0 -I/usr/include/json-glib-1.0 -I/usr/include/pango-1.0
	-I/usr/include/fribidi -I/usr/include/gdk-pixbuf-2.0 -I/usr/include/libwacom-1.0
	-I/usr/include/sysprof-3 -fvisibility=hidden -fdiagnostics-color=always
	-pipe -D_FILE_OFFSET_BITS=64 -D_GNU_SOURCE -frecord-gcc-switches -Wall -g
	'clutter/clutter/50bf134@@mutter-clutter-5 на sha/clutter-scriptable.c.o' -MF
	'clutter/clutter/50bf134@@mutter-clutter-5 на sha/clutter-scriptable.c.o.d' -o
	'clutter/clutter/50bf134@@mutter-clutter-5 на sha/clutter-scriptable.c.o' -c
	from ../clutter/clutter/clutter-scriptable.c:46:
	../cogl/cogl-path/cogl-path.h:55:10: fatal error: cogl-path/cogl-path-enum-types.h:
	No such file or directory
	55 | #include <cogl-path/cogl-path-enum-types.h>

	# socket is non blocking, switching to blocking mode
	#   Failed test 'Read some data from the socket'
	#   at t/23connect.t line 79.
	#   Failed test 'CONNECTed to the TCP server and got the banner'
	#   at t/23connect.t line 80.
	t/23connect.t		(Wstat: 0 Tests: 4 Failed: 2)
	Failed tests:  2-3
	Files=37, Tests=465, 12 wallclock secs ( 0.11 usr  0.03 sys +  4.69 cusr  0.61 csys =
	5.44 CPU)
	Result: FAIL
	Failed 1/37 test programs. 2/465 subtests failed.
	make: *** [Makefile:792: test_dynamic] Error 255

	Result: FAIL
	Failed 1/12 test programs. 0/920 subtests failed.
	make: *** [Makefile:780: test_dynamic] Error 255

	cmd/podman/varlink/generate.go:3: running "go": exit status 1
	make: *** [Makefile:499: cmd/podman/varlink/iopodman.go] Error 1
	make: Leaving directory '/usr/src/RPM/BUILD/podman-1.6.4'
	make: *** Waiting for unfinished jobs....
	make: Entering directory '/usr/src/RPM/BUILD/podman-1.6.4'
	mkdir -p "/usr/src/RPM/BUILD/podman-1.6.4/_output/src/github.com/containers"
	ln -sfn "/usr/src/RPM/BUILD/podman-1.6.4"
	ln -sfn "/usr/src/RPM/BUILD/podman-1.6.4/vendor/github.com/varlink"
	touch .gopathok
	make: Leaving directory '/usr/src/RPM/BUILD/podman-1.6.4'

	+ true
	+ date
	Tue Jan  7 04:50:27 UTC 2020
	+ sleep 7m
	+ true
	+ date
	Tue Jan  7 04:57:27 UTC 2020
	+ sleep 7m
	+ true
	hasher-priv: master: time elapsed limit (18000 seconds) exceeded

	make: Leaving directory '/usr/src/RPM/BUILD/quilt-0.66-alt1'
	make: Entering directory '/usr/src/RPM/BUILD/quilt-0.66-alt1'
	66 commands (66 passed, 0 failed)
	make: Leaving directory '/usr/src/RPM/BUILD/quilt-0.66-alt1'
	make: Entering directory '/usr/src/RPM/BUILD/quilt-0.66-alt1'
	57 commands (57 passed, 0 failed)
	make: Leaving directory '/usr/src/RPM/BUILD/quilt-0.66-alt1'
	make: Target 'check' not remade because of errors.

	6 error logs REMOVED from the list

Total 597 error logs.

Подробная информация о списке рассылки Sisyphus-cybertalk