[cyber] I: Sisyphus-20200211 i586 beehive_status: +17 -19 (473)
ALT beekeeper
hiver на altlinux.org
Вт Фев 11 18:03:28 MSK 2020
17 NEW error logs
bzr-2.7.0-alt3.bzr20170317
rpm-build-licenses is already the newest version.
E: Couldn't find package python-module-Pyrex
hsh-install: Failed to calculate package file list.
engcom-1.38-alt1
+ ./engcom_parser.py engcom.koi
/usr/bin/env: 'python': No such file or directory
gromacs-4.0.7-alt8
In file included from /usr/include/stdio.h:867,
from ../../../include/string2.h:56,
from ../../../src/tools/gmx_xpm2ps.c:41:
/usr/include/bits/stdio2.h:36:10: note: '__builtin___sprintf_chk' output between 2 and
14 bytes into a destination of size 12
36 | return __builtin___sprintf_chk (__s, __USE_FORTIFY_LEVEL - 1,
37 | __bos (__s), __fmt, __va_arg_pack ());
make[3]: Leaving directory '/usr/src/RPM/BUILD/gromacs-4.0.7/mpi-single/src/tools'
make[2]: *** [Makefile:387: all-recursive] Error 1
make[1]: *** [Makefile:326: all] Error 2
make: *** [Makefile:415: all-recursive] Error 1
h5py-2.9.0-alt2
Selecting python-dev for 'python-devel'
E: Couldn't find package python-module-Pyrex
hsh-install: Failed to calculate package file list.
libsignal-protocol-c-2.3.2-alt1
13/13 Test #13: test_device_consistency .......... Passed 0.07 sec
92% tests passed, 1 tests failed out of 13
Total Test time (real) = 14.55 sec
The following tests FAILED:
11 - test_group_cipher (Failed)
mate-notification-daemon-1:1.22.1-alt1
i586-alt-linux-gcc -DHAVE_CONFIG_H -I. -I../.. -I../.. -D_REENTRANT -pthread
-I/usr/include/libwnck-3.0 -I/usr/include/gtk-3.0 -I/usr/include/gio-unix-2.0
-I/usr/include/cairo -I/usr/include/pango-1.0 -I/usr/include/atk-1.0 -I/usr/include/cairo
-I/usr/include/freetype2 -I/usr/include/harfbuzz -I/usr/include/libpng16
-I/usr/include/gdk-pixbuf-2.0 -I/usr/include/libpng16 -I/usr/include/glib-2.0
-I/usr/lib/glib-2.0/include -DENGINES_DIR=\"/usr/lib/mate-notification-daemon/engines\"
-Wall -Wmissing-prototypes -Wnested-externs -Wpointer-arith -Wno-sign-compare -pipe
-frecord-gcc-switches -Wall -g -O2 -march=i586 -mtune=generic -c -o daemon.o daemon.c
daemon.c:50:10: fatal error: mnd-dbus-generated.h: No such file or directory
50 | #include "mnd-dbus-generated.h"
perl-Server-Starter-0.35-alt1
received TERM, sending TERM to all workers:3564878
hasher-priv: master: idle time limit (3600 seconds) exceeded
python-module-Cellulose-0.2-alt2.1
Selecting python-module-mysqlclient for 'python-module-MySQLdb'
E: Couldn't find package python-module-Pyrex
hsh-install: Failed to calculate package file list.
python-module-Pygments-2.4.2-alt1
rpm-macros-sphinx is already the newest version.
E: Couldn't find package python-module-Pyrex
hsh-install: Failed to calculate package file list.
python-module-Rabbyt-0.8.3-alt1
Selecting python-module-mysqlclient for 'python-module-MySQLdb'
E: Couldn't find package python-module-Pyrex
hsh-install: Failed to calculate package file list.
python-module-dabo-0.9.14-alt1
Selecting python-module-mysqlclient for 'python-module-MySQLdb'
E: Couldn't find package python-module-Pyrex
hsh-install: Failed to calculate package file list.
python-module-numpy-1:1.15.4-alt3
Selecting python-dev for 'python-devel'
E: Couldn't find package python-module-Pyrex
hsh-install: Failed to calculate package file list.
python-module-protocols-1.0-alt0.1.1.2.1.1
Building Dependency Tree...
E: Couldn't find package python-module-Pyrex
hsh-install: Failed to calculate package file list.
python-module-pytest-cov-2.8.1-alt1
Б°■ OK py27 in 7 minutes, 36.355 seconds
hasher-priv: master: idle time limit (3600 seconds) exceeded
python-module-rdflib-4.2.2-alt2
Selecting python-dev for 'python-devel'
E: Couldn't find package python-module-Pyrex
hsh-install: Failed to calculate package file list.
python-module-scipy-1.2.0-alt5
rpm-macros-sphinx is already the newest version.
E: Couldn't find package python-module-Pyrex
hsh-install: Failed to calculate package file list.
python-module-spidermonkey-0.0.10-alt5
MI2a: mark python-module-pkg_resources
E: Couldn't find package python-module-Pyrex
hsh-install: Failed to calculate package file list.
19 error logs REMOVED from the list
apache-commons-math-0:3.4.1-alt2_10jpp8
apache-commons-pool2-2.4.2-alt4_7jpp8
bashdb-4.4_0.94-alt1
custodia-0.6.0-alt5
derby-0:10.13.1.1-alt1_4jpp8
gnochm-0.9.11-alt1.2.qa1.1
gnustep-make-2.6.6-alt20.svn20140202
java-10-openjdk-0:10.0.2.13-alt1_7jpp9
kde5-kpat-18.04.3-alt2
libopenshot-0.2.2-alt1
libopenshot-audio-0.1.7-alt1
librabbitmq-c-0.9.0-alt1
lsb-4.0-alt9
makedict-0.4.1_beta1-alt2.git.ga70119
mk-files-20180528-alt1
perl-HTTP-Proxy-0.304-alt2
python-module-tlslite-0.4.9-alt1
python3-module-pytest-bdd-3.1.1-alt2
thunderbird-68.4.2-alt1
Total 473 error logs.
Подробная информация о списке рассылки Sisyphus-cybertalk