[cyber] I: p9-20200809 i586 beehive_status: +12 -7 (120)
ALT beekeeper
hiver на altlinux.org
Вс Авг 9 15:22:24 MSK 2020
12 NEW error logs
apache-commons-ognl-3.0.2-alt2_15.20120313svn1102435jpp8
[ERROR]
[ERROR] Please refer to
/usr/src/RPM/BUILD/apache-commons-ognl-3.0.2/target/surefire-reports for the individual
test results.
[ERROR] Please refer to dump files (if any exist) [date]-jvmRun[N].dump, [date].dumpstream
and [date]-jvmRun[N].dumpstream.
[ERROR] -> [Help 1]
[ERROR]
[ERROR] To see the full stack trace of the errors, re-run Maven with the -e switch.
[ERROR] Re-run Maven using the -X switch to enable full debug logging.
[ERROR]
[ERROR] For more information about the errors and possible solutions, please read the
following articles:
[ERROR] [Help 1] http://cwiki.apache.org/confluence/display/MAVEN/MojoFailureException
atlas-3.9.35-alt1.qa1
/usr/src/RPM/BUILD/ATLAS/BUILD/..//include/atlas_mmparse.h:78
hasher-priv: master: idle time limit (3600 seconds) exceeded
automake_1.11-1.11.6-alt9
checking for upc... no
configure: error: no Unified Parallel C compiler was found
+ exit_status=77
--
+ exit 77
1 of 893 tests failed
(58 tests were not run)
dopewars-1.5.12-alt1_20.1033svn
/bin/sh ../../libtool --mode=link i586-alt-linux-gcc -pipe -frecord-gcc-switches -Wall -g
-O2 -march=i586 -mtune=generic -Wall -o libsound_sdl.la -rpath /usr/lib -lSDL -lpthread
-lSDL_mixer sound_sdl.lo -lglib-2.0
libtool: link: rm -fr .libs/libsound_sdl.a
libtool: link: i586-alt-linux-gcc -shared -fPIC -DPIC .libs/sound_sdl.o -lSDL
-lpthread -lSDL_mixer -lglib-2.0 -g -O2 -march=i586 -mtune=generic -Wl,-soname
-Wl,libsound_sdl.so.0 -o .libs/libsound_sdl.so.0.0.0
libtool: link: (cd ".libs" && rm -f "libsound_sdl.so.0" && ln -s "libsound_sdl.so.0.0.0"
"libsound_sdl.so.0")
libtool: link: (cd ".libs" && rm -f "libsound_sdl.so" && ln -s "libsound_sdl.so.0.0.0"
"libsound_sdl.so")
libtool: link: ( cd ".libs" && rm -f "libsound_sdl.la" && ln -s "../libsound_sdl.la"
"libsound_sdl.la" )
make[3]: Leaving directory '/usr/src/RPM/BUILD/dopewars/src/plugins'
make[2]: *** [Makefile:574: all-recursive] Error 1
make[1]: *** [Makefile:474: all-recursive] Error 1
make: *** [Makefile:402: all] Error 2
gst-plugins-bad1.0-1.16.1-alt2
[648/825] Compiling C object 'ext/vulkan/dc92c40@@gstvulkan на sha/vkerror.c.o'.
FAILED: ext/vulkan/dc92c40@@gstvulkan на sha/vkerror.c.o
cc -Iext/vulkan/dc92c40@@gstvulkan на sha -Iext/vulkan -I../ext/vulkan -I. -I../
-I/usr/include/orc-0.4 -I/usr/include/gstreamer-1.0 -I/usr/include/glib-2.0
-I/usr/lib/glib-2.0/include -fdiagnostics-color=always -pipe -D_FILE_OFFSET_BITS=64
-fvisibility=hidden -fno-strict-aliasing -DG_DISABLE_CAST_CHECKS -Wmissing-prototypes
-Wdeclaration-after-statement -Wold-style-definition -Wmissing-declarations
-Wredundant-decls -Wwrite-strings -Wformat -Wformat-security -Winit-self
-Wmissing-include-dirs -Waddress -Wno-multichar -Wvla -Wpointer-arith
-frecord-gcc-switches -Wall -g -O2 -march=i586 -mtune=generic -fPIC -pthread
-DHAVE_CONFIG_H -MD -MQ 'ext/vulkan/dc92c40@@gstvulkan на sha/vkerror.c.o'
-MF 'ext/vulkan/dc92c40@@gstvulkan на sha/vkerror.c.o.d' -o
'ext/vulkan/dc92c40@@gstvulkan на sha/vkerror.c.o' -c ../ext/vulkan/vkerror.c
../ext/vulkan/vkerror.c: In function Б─≤_vk_result_to_stringБ─≥:
../ext/vulkan/vkerror.c:66:16: error: Б─≤VK_RESULT_BEGIN_RANGEБ─≥ undeclared (first
use in this function); did you mean Б─≤VK_RESULT_MAX_ENUMБ─≥?
if (result < VK_RESULT_BEGIN_RANGE)
libgtk4-3.96.0-alt1
[179/1447] Compiling C object 'gdk/ffe01f7@@gdk на sta/gdkvulkancontext.c.o'.
FAILED: gdk/ffe01f7@@gdk на sta/gdkvulkancontext.c.o
cc -Igdk/ffe01f7@@gdk на sta -Igdk -I../gdk -I. -I../ -Igdk/x11 -I../gdk/x11 -Igdk/wayland
-Igtk/css -I/usr/include/gdk-pixbuf-2.0 -I/usr/include/libpng16 -I/usr/include/glib-2.0
-I/usr/lib/glib-2.0/include -I/usr/include/cairo -I/usr/include/freetype2
-I/usr/include/harfbuzz -I/usr/include/pango-1.0 -I/usr/include/fribidi
-I/usr/include/graphene-1.0 -I/usr/lib/graphene-1.0/include -I/usr/include/gio-unix-2.0
-fdiagnostics-color=always -pipe -D_FILE_OFFSET_BITS=64 -std=gnu99 -DG_LOG_USE_STRUCTURED=1
-DGLIB_MIN_REQUIRED_VERSION=GLIB_VERSION_2_58 -DGLIB_MAX_ALLOWED_VERSION=GLIB_VERSION_2_60
'-DGTK_VERSION="3.96.0"' -D_GNU_SOURCE -frecord-gcc-switches -Wall -g -O2 -march=i586
-mtune=generic -fPIC -pthread -DGDK_COMPILATION '-DG_LOG_DOMAIN="Gdk"' -fno-strict-aliasing
-Wcast-align -Wformat=2 -Wformat-nonliteral -Wformat-security -Wignored-qualifiers
-Wimplicit-function-declaration -Wlogical-op -Wmissing-format-attribute
-Wmissing-include-dirs -Wmissing-noreturn -Wnested-externs -Wold-style-definition
-Wpointer-arith -Wshadow -Wstrict-prototypes -Wswitch-default -Wswitch-enum -Wundef
-Wuninitialized -Wunused -Werror=address -Werror=array-bounds -Werror=empty-body
-Werror=implicit -Werror=implicit-fallthrough -Werror=init-self -Werror=int-to-pointer-cast
-Werror=main -Werror=missing-braces -Werror=missing-declarations -Werror=missing-prototypes
-Werror=nonnull -Werror=pointer-to-int-cast -Werror=redundant-decls -Werror=return-type
-Werror=sequence-point -Werror=trigraphs -Werror=vla -Werror=write-strings
-fvisibility=hidden -MD -MQ 'gdk/ffe01f7@@gdk на sta/gdkvulkancontext.c.o'
-MF 'gdk/ffe01f7@@gdk на sta/gdkvulkancontext.c.o.d' -o
'gdk/ffe01f7@@gdk на sta/gdkvulkancontext.c.o' -c ../gdk/gdkvulkancontext.c
../gdk/gdkvulkancontext.c: In function Б─≤gdk_vulkan_strerrorБ─≥:
../gdk/gdkvulkancontext.c:202:10: error: Б─≤VK_RESULT_RANGE_SIZEБ─≥ undeclared (first
use in this function); did you mean Б─≤VK_RESULT_MAX_ENUMБ─≥?
case VK_RESULT_RANGE_SIZE:
metacity3.0-3.32.0-alt1
compositor/meta-compositor-vulkan.c: In function 'device_type_to_string':
compositor/meta-compositor-vulkan.c:817:12: error: 'VK_PHYSICAL_DEVICE_TYPE_RANGE_SIZE'
undeclared (first use in this function); did you mean 'VK_PHYSICAL_DEVICE_TYPE_MAX_ENUM'?
case VK_PHYSICAL_DEVICE_TYPE_RANGE_SIZE:
perl-IO-Event-0.813-alt2
Result: FAIL
Failed 1/12 test programs. 0/920 subtests failed.
make: *** [Makefile:780: test_dynamic] Error 255
python-module-pebble-4.3.7-alt1.git20180228
collecting ... collected 41 items
test/test_process_pool_spawn.py::TestProcessPool::test_process_pool_broken_initializer
FAILED [ 2%]
test/test_process_pool_spawn.py::TestProcessPool::test_process_pool_callback PASSED [ 4%]
--
> pool.schedule(function)
E AssertionError: RuntimeError not raised
test/test_process_pool_spawn.py:212: AssertionError
----------------------------- Captured stderr call -----------------------------
ERROR:root:BOOM!
Traceback (most recent call last):
--
Exception: BOOM!
ERROR:root:BOOM!
Traceback (most recent call last):
--
Exception: BOOM!
ERROR:root:BOOM!
Traceback (most recent call last):
--
Exception: BOOM!
ERROR:root:BOOM!
Traceback (most recent call last):
--
Exception: BOOM!
ERROR:root:BOOM!
Traceback (most recent call last):
--
Exception: BOOM!
ERROR:root:BOOM!
Traceback (most recent call last):
--
Exception: BOOM!
ERROR:root:BOOM!
Traceback (most recent call last):
--
Exception: BOOM!
ERROR:root:BOOM!
Traceback (most recent call last):
python-module-pexpect-4.6-alt3
tests/test_performance.py::PerformanceTestCase::test_100000 PASSED [ 54%]
tests/test_performance.py::PerformanceTestCase::test_large_stdout_stream FAILED [ 54%]
tests/test_pickling.py::PickleTest::test_picking PASSED [ 55%]
--
> assert resp == 1 # index 1 == EOF
E AssertionError: assert 2 == 1
tests/test_performance.py:110: AssertionError
sgc-0.2.1-alt3
+ xvfb-run sh makedocs
_XSERVTransmkdir: ERROR: euid != 0,directory /tmp/.X11-unix will not be created.
The XKEYBOARD keymap compiler (xkbcomp) reports:
--
pygame.display.init()
error: Couldn't open X11 display
The full traceback has been saved in /usr/src/tmp/sphinx-err-Chzfm6.log, if you want
to report the issue to the developers.
vkd3d-1.1-alt0.3.gbe4ca96
In file included from libs/vkd3d/command.c:20:
libs/vkd3d/vkd3d_private.h:867:54: error: 'VK_PIPELINE_BIND_POINT_RANGE_SIZE' undeclared
here (not in a function); did you mean 'VK_PIPELINE_BIND_POINT_MAX_ENUM'?
struct vkd3d_pipeline_bindings pipeline_bindings[VK_PIPELINE_BIND_POINT_RANGE_SIZE];
--
In file included from libs/vkd3d/state.c:20:
libs/vkd3d/vkd3d_private.h:867:54: error: 'VK_PIPELINE_BIND_POINT_RANGE_SIZE' undeclared
here (not in a function); did you mean 'VK_PIPELINE_BIND_POINT_MAX_ENUM'?
struct vkd3d_pipeline_bindings pipeline_bindings[VK_PIPELINE_BIND_POINT_RANGE_SIZE];
--
In file included from libs/vkd3d/device.c:19:
libs/vkd3d/vkd3d_private.h:867:54: error: 'VK_PIPELINE_BIND_POINT_RANGE_SIZE' undeclared
here (not in a function); did you mean 'VK_PIPELINE_BIND_POINT_MAX_ENUM'?
struct vkd3d_pipeline_bindings pipeline_bindings[VK_PIPELINE_BIND_POINT_RANGE_SIZE];
--
In file included from libs/vkd3d/resource.c:19:
libs/vkd3d/vkd3d_private.h:867:54: error: 'VK_PIPELINE_BIND_POINT_RANGE_SIZE' undeclared
here (not in a function); did you mean 'VK_PIPELINE_BIND_POINT_MAX_ENUM'?
struct vkd3d_pipeline_bindings pipeline_bindings[VK_PIPELINE_BIND_POINT_RANGE_SIZE];
7 error logs REMOVED from the list
compiz-0.9.14.1-alt1
curl-7.71.0-alt1
fortranposix-0.1.1-alt1
gprolog-1.4.4-alt2
gromacs-4.0.7-alt8
joda-time-0:2.9.9-alt1_3.tzdata2017bjpp8
libsmi-0.5.0-alt1.svn1841
Total 120 error logs.
Подробная информация о списке рассылки Sisyphus-cybertalk