[cyber] I: Sisyphus-20190907 i586 beehive_status: +10 -7 (104)
ALT beekeeper
hiver на altlinux.org
Сб Сен 7 17:07:21 MSK 2019
10 NEW error logs
SNNS-4.3-alt1.1.1.1
/usr/bin/ld.default: ../../kernel/sources/libfunc.a(func_tbl.o):(.data.rel+0xc0c):
undefined reference to `LEARN_backpropClassJogChunk'
/usr/bin/ld.default: ../../kernel/sources/libfunc.a(func_tbl.o):(.data.rel+0xc1c):
undefined reference to `LEARN_backpropJogChunk'
/usr/bin/ld.default: ../../kernel/sources/libfunc.a(func_tbl.o):(.data.rel+0xc2c):
undefined reference to `LEARN_backpropMomentum'
/usr/bin/ld.default: ../../kernel/sources/libfunc.a(func_tbl.o):(.data.rel+0xc3c):
undefined reference to `LEARN_backpropWeightDecay'
/usr/bin/ld.default: ../../kernel/sources/libfunc.a(func_tbl.o):(.data.rel+0xc4c):
undefined reference to `LEARN_BPTT'
/usr/bin/ld.default: ../../kernel/sources/libfunc.a(func_tbl.o):(.data.rel+0xc5c):
undefined reference to `LEARN_BBPTT'
/usr/bin/ld.default: ../../kernel/sources/libfunc.a(func_tbl.o):(.data.rel+0xc7c):
undefined reference to `LEARN_CPN'
/usr/bin/ld.default: ../../kernel/sources/libfunc.a(func_tbl.o):(.data.rel+0xc9c):
undefined reference to `LEARN_HEBB'
/usr/bin/ld.default: ../../kernel/sources/libfunc.a(func_tbl.o):(.data.rel+0xcac):
undefined reference to `LEARN_JE_Backprop'
/usr/bin/ld.default: ../../kernel/sources/libfunc.a(func_tbl.o):(.data.rel+0xcbc):
undefined reference to `LEARN_JE_BackpropMomentum'
/usr/bin/ld.default: ../../kernel/sources/libfunc.a(func_tbl.o):(.data.rel+0xccc):
undefined reference to `LEARN_JE_Quickprop'
compiz-0.9.14.0-alt1
make[1]: Entering directory '/usr/src/RPM/BUILD/compiz-0.9.14.0/i586-alt-linux'
[ 11%] Built target compiz_timer
make[1]: Leaving directory '/usr/src/RPM/BUILD/compiz-0.9.14.0/i586-alt-linux'
make[2]: Entering directory '/usr/src/RPM/BUILD/compiz-0.9.14.0/i586-alt-linux'
[ 0%] Generating ../../po/compiz.pot
make[2]: Leaving directory '/usr/src/RPM/BUILD/compiz-0.9.14.0/i586-alt-linux'
make[1]: Entering directory '/usr/src/RPM/BUILD/compiz-0.9.14.0/i586-alt-linux'
[ 11%] Built target nls
make[1]: Leaving directory '/usr/src/RPM/BUILD/compiz-0.9.14.0/i586-alt-linux'
make: *** [Makefile:163: all] Error 2
perl-IO-Event-0.813-alt2
Result: FAIL
Failed 1/12 test programs. 0/920 subtests failed.
make: *** [Makefile:780: test_dynamic] Error 255
perl-Parallel-Prefork-0.18-alt1_7
t/06-wait-all-children-with-timeout.t .... ok
# Failed test 'wait_all_children does not block'
# at t/07-wait-all-children-does-not-block.t line 22.
--
t/07-wait-all-children-does-not-block.t (Wstat: 256 Tests: 1 Failed: 1)
Failed test: 1
Non-zero exit status: 1
--
Result: FAIL
Failed 1/7 test programs. 1/29 subtests failed.
make: *** [Makefile:775: test_dynamic] Error 1
perl-Time-Format_XS-1.03-alt5
t/func.t ...... ok
# Failed test 'm test: Hour12:'
# at t/iso8601.t line 248.
--
t/iso8601.t (Wstat: 256 Tests: 231 Failed: 1)
Failed test: 181
Non-zero exit status: 1
--
Result: FAIL
Failed 1/4 test programs. 1/414 subtests failed.
make: *** [Makefile:959: test_dynamic] Error 255
python-module-coverage-4.5.4-alt2
[3675] /usr/src/RPM/BUILD/python-module-coverage-4.5.4$
/usr/src/RPM/BUILD/python-module-coverage-4.5.4/.tox/py37/bin/python -m pip freeze
>.tox/py37/log/py37-3.log
py37 installed: ERROR: Error [Errno
2] No such file or directory: 'git': 'git' while executing command git
rev-parse,alabaster==0.7.6,apipkg==1.5,appdirs==1.4.3,argcomplete==1.9.4,asn1crypto==0.24.0,atomicwrites==1.3.0,attrs==19.1.0,Automat==0.7.0,Babel==2.6.0,certifi==2016.9.26,cffi==1.12.3,chardet==3.0.4,Click==7.0,constantly==15.1.0,#
Editable install with no version control (coverage==4.5.4),-e
/usr/src/RPM/BUILD/python-module-coverage-4.5.4,cryptography==2.7,cssselect==0.9.1,decorator==4.3.0,dnspython==1.15.0,docutils==0.14,eventlet==0.24.1,execnet==1.7.0,facebook-scribe==2.0,filelock==3.0.10,flaky==3.6.1,future==0.16.0,Genshi==0.7,gevent==1.4.0,greenlet==0.4.15,h2==3.0.1,hpack==3.0.0,html5lib==0.999999999,hyperframe==5.2.0,hyperlink==19.0.0,idna==2.8,imagesize==1.1.0,importlib-metadata==0.19,incremental==17.5.0,iniconfig==1.0.0,Jinja2==2.10,linecache2==1.0.0,lxml==4.4.1,MarkupSafe==0.23,mock==2.0.0,monotonic==1.5,more-itertools==7.0.0,ndg-httpsclient==0.4.2,nose==1.3.7,numpy==1.15.4,packaging==19.0,pbr==5.4.2,pluggy==0.12.0,priority==1.3.0,psycopg2==2.8.3,py==1.8.0,pyasn1==0.4.5,pycares==2.3.0,PyContracts==1.8.12,pycparser==2.19,pycrypto==2.7a1,Pygments==2.4.2,PyHamcrest==2.0.0a1,pymongo==3.8.0,pyOpenSSL==18.0.0,pyparsing==2.4.2,pyserial==3.4,pytest==5.1.2,pytest-forked==1.0.2,pytest-xdist==1.29.0,python-ntlm==1.1.0,pytz==2016.10,requests==2.21.0,servicemanager==0.0.16,six==1.12.0,snowballstemmer==1.2.0,Sphinx==1.6.5.dev20190610,sphinxcontrib-websupport==1.0.1.dev20190623,SQLAlchemy==1.3.8.dev0,thrift==0.9.2,toml==0.10.0,tornado==5.1.1,tox==3.13.2,traceback2==1.4.0,Twisted==18.9.0,unittest-mixins==1.6,unittest2==1.1.0,urllib3==1.24.3,virtualenv==16.7.2,wcwidth==0.1.7,webencodings==0.5.1,Whoosh==2.7.4,zipp==0.5.0,zope.interface==4.6.0
py37 run-test-pre: PYTHONHASHSEED='3822507935'
--
self.assertEqual(out.rstrip(), expected_out)
E AssertionError: 'Coverage.py warning: No data was collecte[106 chars]2695' !=
'3 pids, total = 92695'
E - Coverage.py warning: No data was collected. (no-data-collected)
--
=========================== short test summary info ============================
FAILED tests/test_concurrency.py::MultiprocessingTest::test_multiprocessing_with_branching
1 failed, 776 passed, 20 skipped in 236.06s (0:03:56)
ERROR: InvocationError for command
/usr/src/RPM/BUILD/python-module-coverage-4.5.4/.tox/py37/bin/python igor.py
test_with_tracer c (exited with code 1)
___________________________________ summary ____________________________________
ERROR: py37: commands failed
python-module-jupyter_console-6.0.0-alt1
jupyter console --help-all works ... ok
Ensure display protocol plain/text key is supported ... ERROR
jupyter console --generate-config works ... ok
--
test_handle_image_tempfile
(jupyter_console.tests.test_image_handler.ZMQTerminalInteractiveShellTestCase) ... ok
ERROR: Ensure display protocol plain/text key is supported
Traceback (most recent call last):
--
Ran 9 tests in 67.611s
FAILED (errors=1)
python-module-pebble-4.3.7-alt1.git20180228
collecting ... collected 41 items
test/test_process_pool_spawn.py::TestProcessPool::test_process_pool_broken_initializer
FAILED [ 2%]
test/test_process_pool_spawn.py::TestProcessPool::test_process_pool_callback PASSED [ 4%]
--
test/test_process_pool_spawn.py::TestProcessPool::test_process_pool_close_stopped PASSED
[ 17%]
test/test_process_pool_spawn.py::TestProcessPool::test_process_pool_different_process
FAILED [ 19%]
test/test_process_pool_spawn.py::TestProcessPool::test_process_pool_error PASSED [ 21%]
--
test/test_process_pool_spawn.py::TestProcessPool::test_process_pool_stop_stopped PASSED
[ 87%]
test/test_process_pool_spawn.py::TestProcessPool::test_process_pool_stop_stopped_callback
FAILED [ 90%]
test/test_process_pool_spawn.py::TestProcessPool::test_process_pool_stop_timeout PASSED
[ 92%]
--
> pool.schedule(function)
E AssertionError: RuntimeError not raised
test/test_process_pool_spawn.py:212: AssertionError
----------------------------- Captured stderr call -----------------------------
ERROR:root:BOOM!
Traceback (most recent call last):
--
Exception: BOOM!
ERROR:root:BOOM!
Traceback (most recent call last):
--
Exception: BOOM!
ERROR:root:BOOM!
Traceback (most recent call last):
--
> self.assertEqual(len(set([f.result() for f in futures])), 2)
E AssertionError: 1 != 2
test/test_process_pool_spawn.py:172: AssertionError
--
> pool.schedule(long_function, args=[index])
E AssertionError: RuntimeError not raised
test/test_process_pool_spawn.py:273: AssertionError
python-module-pytest-cov-2.7.1-alt2
Б°■ OK py27 in 6 minutes, 54.43 seconds
hasher-priv: master: idle time limit (3600 seconds) exceeded
sgc-0.2.1-alt3
+ xvfb-run sh makedocs
_XSERVTransmkdir: ERROR: euid != 0,directory /tmp/.X11-unix will not be created.
The XKEYBOARD keymap compiler (xkbcomp) reports:
--
pygame.display.init()
error: Couldn't open X11 display
The full traceback has been saved in /usr/src/tmp/sphinx-err-SGsoqc.log, if you want
to report the issue to the developers.
7 error logs REMOVED from the list
flac-1.3.2-alt2
fzf-0.18.0-alt1
ghc8.6.4-sha-1.6.4.4-alt1
jed-2:0.99.19-alt2.qa2.1
libsmi-0.5.0-alt1.svn1841
pommed-1.39-alt8
python-module-eventlet-0.24.1-alt1
Total 104 error logs.
Подробная информация о списке рассылки Sisyphus-cybertalk