[cyber] I: Sisyphus-20191115 i586 beehive_status: +17 -13 (356)
ALT beekeeper
hiver на altlinux.org
Пт Ноя 15 17:09:02 MSK 2019
17 NEW error logs
SNNS-4.3-alt1.1.1.1
ar rc lib3d.a net_analyzer.o d3_xUtils.o d3_global.o d3_anageo.o d3_shade.o d3_lists.o
d3_point.o d3_dither.o d3_zgraph.o d3_fonts.o d3_graph.o d3_draw.o d3_disp.o d3_move.o
d3_zValue.o d3_setup.o d3_units.o d3_links.o d3_model.o d3_project.o d3_light.o
d3_pannels.o d3_main.o bn_bignet.o bn_basics.o bn_art1.o bn_art2.o bn_artmap.o
bn_TD_bignet.o bn_kohonen.o bn_assoz.o o_graph.o bn_JordElm.o ui_class.o bn_bighop.o
ranlib lib3d.a
make[1]: Leaving directory '/usr/src/RPM/BUILD/SNNSv4.3/xgui/sources'
make[1]: Entering directory '/usr/src/RPM/BUILD/SNNSv4.3/xgui/sources'
i586-alt-linux-gcc libxgui1.a libxgui2.a lib3d.a \
-lXaw3d -lXmu -lXt -lXext -lSM -lICE -lX11 \
../../kernel/sources/libkernel.a ../../kernel/sources/libfunc.a -lm -lfl -o xgui
/usr/bin/ld.default: libxgui1.a(ui_controlP.o): in function `ui_rem_performPrunInit':
/usr/src/RPM/BUILD/SNNSv4.3/xgui/sources/ui_controlP.c:1191: warning: the use of
`tempnam' is dangerous, better use `mkstemp'
make[1]: Leaving directory '/usr/src/RPM/BUILD/SNNSv4.3/xgui/sources'
certmonger-0.79.8-alt2
Running test 028-dbus...
hasher-priv: master: idle time limit (3600 seconds) exceeded
cockpit-202-alt1
# WebSocket-DEBUG: message: delivering 1 with 10000 length
# WebSocket-DEBUG: sent frame
# WebSocket-DEBUG: received frame 1 with 10000 payload
# WebSocket-DEBUG: message: delivering 1 with 10000 length
# WebSocket-DEBUG: received frame 1 with 10000 payload
# WebSocket-DEBUG: message: delivering 1 with 10000 length
# WebSocket-DEBUG: sent frame
# WebSocket-DEBUG: received frame 1 with 10000 payload
# WebSocket-DEBUG: message: delivering 1 with 10000 length
# WebSocket-DEBUG: received frame 1 with 10000 payload
earlyoom-1.3-alt2
+ make -j8 test
make: Entering directory '/usr/src/RPM/BUILD/earlyoom-1.3'
cd tests ; go test -v
=== RUN TestCli
/bin/sh: line 1: 39447 Killed go test -v
make: *** [Makefile:82: test] Error 137
make: Leaving directory '/usr/src/RPM/BUILD/earlyoom-1.3'
+ exit 0
Processing files: earlyoom-1.3-alt2
Command terminated by signal 9
java-10-openjdk-0:10.0.2.13-alt1_7jpp9
vm_info: OpenJDK Server VM (10.0.2+13) for linux-x86 JRE (10.0.2+13), built on Nov 15
2019 06:54:08 by "builder" with gcc 9.2.1 20190827 (ALT Sisyphus 9.2.1-alt2)
END.
+ false
error: Bad exit status from /usr/src/tmp/rpm-tmp.15677 (%build)
RPM build errors:
Unparseable macro: % = %%{epoch}:%%{version}
Unparseable macro: % = %%{epoch}:%%{javaver}
Unparseable macro: % = %%{epoch}:%%{version}
Unparseable macro: % = %%{epoch}:%%{javaver}
Unparseable macro: %.*}"
libsmi-0.5.0-alt1.svn1841
error.h:25:33: warning: implicit declaration of function 'smiyyerror'; did you mean
'yyerror'? [-Wimplicit-function-declaration]
25 | #define yyerror(parserPtr, msg) smiyyerror(msg, parserPtr)
parser-yang.c:4845:9: note: in expansion of macro 'yyerror'
4845 | yyerror (parserPtr, yymsgp);
At top level:
parser-yang.y:87:13: warning: 'pushDecl' defined but not used [-Wunused-function]
87 | static void pushDecl(YangDecl decl)
make[2]: Leaving directory '/usr/src/RPM/BUILD/libsmi-0.5.0/lib'
make[1]: *** [Makefile:516: all-recursive] Error 1
make: *** [Makefile:402: all] Error 2
libtool_2.4-2.4.6-alt1
make[3]: Leaving directory '/usr/src/RPM/BUILD/libtool-2.4.6'
hasher-priv: master: idle time limit (3600 seconds) exceeded
perl-HTTP-Proxy-0.304-alt2
# socket is non blocking, switching to blocking mode
# Failed test 'Read some data from the socket'
# at t/23connect.t line 79.
# Failed test 'CONNECTed to the TCP server and got the banner'
# at t/23connect.t line 80.
--
t/23connect.t (Wstat: 0 Tests: 4 Failed: 2)
Failed tests: 2-3
Files=37, Tests=465, 14 wallclock secs ( 0.13 usr 0.03 sys + 6.53 cusr 0.56 csys =
7.25 CPU)
Result: FAIL
Failed 1/37 test programs. 2/465 subtests failed.
make: *** [Makefile:792: test_dynamic] Error 255
perl-Net-Server-Mail-0.28-alt1
t/smtp.t ...... ok
# Error: Can't call method "peerhost" on an undefined value at t/starttls.t line 131.
# kill 9, 10007 (server)
--
Result: FAIL
Failed 1/4 test programs. 0/33 subtests failed.
make: *** [Makefile:783: test_dynamic] Error 255
perl-POSIX-1003-0.99_07-alt1.1
Cannot find blib even in /usr/src/RPM/BUILD/POSIX-1003-0.99_07/../../../../..
BEGIN failed--compilation aborted at lists.PL line 11.
make: *** [Makefile:1113: system.c] Error 2
python-module-clize-4.0.3-alt1
in_args = attr.ib(convert=tuple)
TypeError: attrib() got an unexpected keyword argument 'convert'
python-module-flake8-3.7.8-alt1
No data to combine
ERROR: InvocationError for command
/usr/src/RPM/BUILD/python-module-flake8-3.7.8/.tox/py27/bin/coverage combine (exited
with code 1)
ERROR: invocation failed (exit code 1)
Б°√ FAIL py27 in 21.365 seconds
--
___________________________________ summary ____________________________________
ERROR: py27: parallel child exit code 1
py37: commands succeeded
python-module-gantt-0.6.0-alt2
import svgwrite
ImportError: No module named svgwrite
make: Leaving directory '/usr/src/RPM/BUILD/python-module-gantt-0.6.0'
--
import svgwrite
ImportError: No module named svgwrite
make: Leaving directory '/usr/src/RPM/BUILD/python3'
--
in_args = attr.ib(convert=tuple)
TypeError: attrib() got an unexpected keyword argument 'convert'
make: *** [Makefile:38: test] Error 1
python-module-pytest-4.6.5-alt1
> assert lines[1].startswith("Omitting 1 identical item")
E AssertionError: assert False
E + where False = <built-in method startswith of unicode object at
0xf790f920>('Omitting 1 identical item')
--
> assert lines[1].startswith("Matching attributes:")
E AssertionError: assert False
E + where False = <built-in method startswith of unicode object at
0xf790f920>('Matching attributes:')
--
is this important to support??
FAILED testing/test_assertion.py::TestAssert_reprcompare_attrsclass::test_attrs
FAILED testing/test_assertion.py::TestAssert_reprcompare_attrsclass::test_attrs_verbose
FAILED
testing/test_assertion.py::TestAssert_reprcompare_attrsclass::test_attrs_with_attribute_comparison_off
= 3 failed, 2142 passed, 51 skipped, 11 xfailed, 1 warnings in 624.07 seconds ==
ERROR: InvocationError for command
/usr/src/RPM/BUILD/python-module-pytest-4.6.5/.tox/py27/bin/pytest --ignore
testing/test_pdb.py --ignore testing/test_terminal.py --ignore testing/test_unittest.py
(exited with code 1)
ERROR: invocation failed (exit code 1)
\u2716 FAIL py27 in 10 minutes, 34.411 seconds\n[65579]
/usr/src/RPM/BUILD/python-module-pytest-4.6.5$ /usr/bin/python
/usr/lib/python2.7/site-packages/tox/__main__.py --sitepackages -p auto -o -v --installpkg
.tox/.tmp/package/1/pytest-4.6.5.tar.gz
--
\u2714 OK py27-pexpect in 1 minute, 6.136 seconds\n___________________________________
summary ____________________________________
ERROR: py27: parallel child exit code 1
py27-pexpect: commands succeeded
python-module-tlslite-ng-0.7.5-alt1
sock.connect(sa)
ConnectionRefusedError: [Errno 111] Connection refused
error: Bad exit status from /usr/src/tmp/rpm-tmp.87018 (%check)
sgc-0.2.1-alt3
+ xvfb-run sh makedocs
_XSERVTransmkdir: ERROR: euid != 0,directory /tmp/.X11-unix will not be created.
The XKEYBOARD keymap compiler (xkbcomp) reports:
--
pygame.display.init()
error: Couldn't open X11 display
The full traceback has been saved in /usr/src/tmp/sphinx-err-RsIT_i.log, if you want
to report the issue to the developers.
vi-traditional-050325-alt1
/usr/bin/ld.default: cannot find -luxre
collect2: error: ld returned 1 exit status
make: *** [Makefile:267: ex] Error 1
13 error logs REMOVED from the list
calligraplan-0:3.1.0-alt7
gear-2.2.0-alt1
gromacs-4.0.7-alt8
kde4libs-4.14.38-alt5
meschach-1.2-alt1.b.3
os-autoinst-4.5.1527308405.8b586d5-alt7
python-module-manhole-1.6.0-alt3
python-module-parallax-1.0.1-alt1
qt4-4.8.7-alt19
qtscriptgenerator-0.2.0-alt3.qa1
shiboken-1.2.2-alt4.git20140422
shiboken-py3-1.2.2-alt4.git20140422
telepathy-logger-qt4-0.8.0-alt4
Total 356 error logs.
Подробная информация о списке рассылки Sisyphus-cybertalk