[cyber] I: Sisyphus-20190719 i586 beehive_status: +7 -6 (63)

ALT beekeeper hiver на altlinux.org
Пт Июл 19 16:20:53 MSK 2019

	7 NEW error logs

	gcc -c -DL2SIZE=4194304 -I/usr/src/RPM/BUILD/ATLAS/BUILD/include
	-I/usr/src/RPM/BUILD/ATLAS/BUILD/..//include/contrib -DAdd_ -DF77_INTEGER=int
	-DStringSunStyle -DATL_OS_Linux -DATL_ARCH_UNKNOWNx86 -DATL_CPUMHZ=2888  -DATL_GAS_x8632
	-DWALL -DATL_DYLIBS -O -fomit-frame
	hasher-priv: master: idle time limit (3600 seconds) exceeded

	# JRE version: OpenJDK Runtime Environment (10.0.2+13) (build 10.0.2+13)
	# Java VM: OpenJDK Server VM (10.0.2+13, mixed mode, tiered, g1 gc, linux-x86)
	# Problematic frame:
	# J 6903 c2 java.security.MessageDigest$Delegate.engineUpdate([BII)V java.base на 10.0.2
	(11 bytes) @ 0xef6d9f9d [0xef6d9b00+0x0000049d]
	# No core dump will be written. Core dumps have been disabled. To enable core dumping,
	try "ulimit -c unlimited" before starting Java again
	# An error report file with more information is saved as:
	# /usr/src/RPM/BUILD/gumtree-2.1.1/hs_err_pid61457.log
	Could not load hsdis-i386.so; library not loadable; PrintAssembly is disabled
	# If you would like to submit a bug report, please visit:
	#   http://bugreport.java.com/bugreport/crash.jsp

	/usr/bin/ld.default: indent.o: file not recognized: file truncated
	collect2: error: ld returned 1 exit status
	make[1]: *** [Makefile:157: /usr/src/RPM/BUILD/jed-0.99-19/src/objs/jed] Error 1

	# socket is non blocking, switching to blocking mode
	#   Failed test 'Read some data from the socket'
	#   at t/23connect.t line 79.
	#   Failed test 'CONNECTed to the TCP server and got the banner'
	#   at t/23connect.t line 80.
	t/23connect.t		(Wstat: 0 Tests: 4 Failed: 2)
	Failed tests:  2-3
	Files=37, Tests=465, 11 wallclock secs ( 0.10 usr  0.02 sys +  4.85 cusr  0.44 csys =
	5.41 CPU)
	Result: FAIL
	Failed 1/37 test programs. 2/465 subtests failed.
	make: *** [Makefile:792: test_dynamic] Error 255

	SKIPPED [5] /usr/src/RPM/BUILD/python-module-pytest-benchmark-3.2.2/tests/test_utils.py:48:
	%r not availabe on $PATH
	FAILED tests/test_normal.py::test_fast - assert 9.894371032714845e-07 >= 1e-06
	============== 1 failed, 219 passed, 10 skipped in 669.07 seconds ==============
	ERROR: InvocationError for command
	-vv tests (exited with code 1)
	ERROR: invocation failed (exit code 1)
	Б°√ FAIL py27-nocov in 11 minutes, 30.809 seconds
	___________________________________ summary ____________________________________
	ERROR:	 py27-nocov: parallel child exit code 1
	py37-nocov: commands succeeded

	cd /usr/src/RPM/BUILD/shogun-6.1.3/src/shogun && /usr/bin/ccache /usr/bin/c++
	-I/usr/src/RPM/BUILD/shogun-6.1.3/src -I/usr/src/RPM/BUILD/shogun-6.1.3/src/gpl
	-I/usr/lib/../include -I/usr/include/json-c -I/usr/include/libxml2 -isystem
	/usr/include/eigen3  -Wall -Wno-unused-parameter -Wformat -Wformat-security -Wparentheses
	-Wshadow -Wno-unknown-pragmas -Wno-deprecated	-O3 -fexpensive-optimizations
	-frerun-cse-after-loop -fcse-follow-jumps -finline-functions -fschedule-insns2
	-fthread-jumps -fforce-addr -fstrength-reduce -funroll-loops -mfpmath=sse
	-fPIC	-std=c++11 -o CMakeFiles/libshogun.dir/base/Parameter.cpp.o -c
	ccache: error: /usr/src/.ccache/ccache.conf: No such file or directory
	make[2]: *** [src/shogun/CMakeFiles/libshogun.dir/build.make:1003:
	src/shogun/CMakeFiles/libshogun.dir/base/Parameter.cpp.o] Error 1

	/usr/bin/ld.default: vsnprintf_r.o: file not recognized: file truncated
	collect2: error: ld returned 1 exit status
	make: *** [Makefile:127: filan] Error 1

	6 error logs REMOVED from the list

Total 63 error logs.

Подробная информация о списке рассылки Sisyphus-cybertalk