[cyber] I: Sisyphus-20190814 x86_64 beehive_status: +10 -5 (54)

ALT beekeeper hiver на altlinux.org
Ср Авг 14 10:12:44 MSK 2019

	10 NEW error logs

	Process completed in 3 millis; below is its output
	org.apache.commons.exec.ExecuteException: Process exited with an error: 2 (Exit value: 2)
	Process completed in 4 millis; below is its output
	[ERROR] testExec41WithStreams(org.apache.commons.exec.issues.Exec41Test)  Time elapsed:
	0.003 s  <<< FAILURE!
	java.lang.AssertionError: The process was killed by the watchdog
	at org.apache.commons.exec.issues.Exec41Test.testExec41WithStreams(Exec41Test.java:96)
	[ERROR] testExec41WithoutStreams(org.apache.commons.exec.issues.Exec41Test)  Time elapsed:
	0.005 s  <<< FAILURE!
	java.lang.AssertionError: The process was killed by the watchdog
	at org.apache.commons.exec.issues.Exec41Test.testExec41WithoutStreams(Exec41Test.java:143)
	[ERROR] testExec_60(org.apache.commons.exec.issues.Exec60Test)	Time elapsed: 0.001 s
	java.lang.AssertionError: Watchdog killed the process
	at org.apache.commons.exec.issues.Exec60Test.testExec_60(Exec60Test.java:76)
	[ERROR] testExec34_2(org.apache.commons.exec.issues.Exec34Test)  Time elapsed: 0.049
	s  <<< FAILURE!
	java.lang.AssertionError: Watchdog should have killed the process
	at org.apache.commons.exec.issues.Exec34Test.testExec34_2(Exec34Test.java:88)
	Process spun off successfully - process=/bin/ls
	hasher-priv: master: idle time limit (3600 seconds) exceeded

	[39/94] Generating FontManager-0.7.5.vapi with a custom command.
	FAILED: lib/common/FontManager-0.7.5.vapi
	/usr/bin/vapigen --quiet --library=FontManager-0.7.5
	--girdir=/usr/src/RPM/BUILD/font-manager-0.7.5/x86_64-alt-linux/lib/unicode --pkg=glib-2.0
	--pkg=gdk-3.0 --pkg=gtk+-3.0 --pkg=json-glib-1.0 --pkg=libxml-2.0 --pkg=sqlite3
	--pkg=Unicode-0.7.5 --metadatadir=/usr/src/RPM/BUILD/font-manager-0.7.5/lib/common
	error: Package `Unicode-0.7.5' not found in specified Vala API directories or
	GObject-Introspection GIR directories
	[40/94] Generating Unicode-0.7.5.gir with a custom command.

	UNSUPPORTED: resolv/tst-resolv-threads
	FAIL: rt/tst-cpuclock1
	UNSUPPORTED: sunrpc/tst-svc_register
	+ rc=2
	+ grep '^FAIL:' build-x86_64-linux/tests.sum
	+ cut '-d ' -f2-
	==> build-x86_64-linux/rt/tst-cpuclock1.test-result <==
	FAIL: rt/tst-cpuclock1
	original exit status 1

	../../../include/vec.h:760:13: warning: 'calc_lll' defined but not used [-Wunused-function]
	static void calc_lll(rvec box,rvec lll)
	In file included from ../../../include/vec.h:121,
	from ../../../src/tools/addconf.c:42:
	../../../include/maths.h:126:1: warning: 'gmx_numzero' defined but not used
	gmx_numzero(double a)
	make[3]: Leaving directory '/usr/src/RPM/BUILD/gromacs-4.0.7/mpi-single/src/tools'
	make[2]: *** [Makefile:387: all-recursive] Error 1
	make[1]: *** [Makefile:326: all] Error 2
	make: *** [Makefile:415: all-recursive] Error 1

	kde-common-devel is already the newest version.
	E: Couldn't find package libkexiv24-devel
	hsh-install: Failed to calculate package file list.

	# socket is non blocking, switching to blocking mode
	#   Failed test 'Read some data from the socket'
	#   at t/23connect.t line 79.
	#   Failed test 'CONNECTed to the TCP server and got the banner'
	#   at t/23connect.t line 80.
	t/23connect.t		(Wstat: 0 Tests: 4 Failed: 2)
	Failed tests:  2-3
	Files=37, Tests=465, 10 wallclock secs ( 0.09 usr  0.03 sys +  3.96 cusr  0.52 csys =
	4.60 CPU)
	Result: FAIL
	Failed 1/37 test programs. 2/465 subtests failed.
	make: *** [Makefile:792: test_dynamic] Error 255

	raise AssertionError(path + ' exists !')
	AssertionError: /tmp/manhole-27175 exists !
	In atexit handler.
	SKIPPED [1] tests/test_manhole.py:413: condition: not is_module_available("signalfd")
	FAILED tests/test_manhole.py::test_stderr_doesnt_deadlock - AssertionError: W...
	=============== 1 failed, 40 passed, 4 skipped in 282.17 seconds ===============
	ERROR: InvocationError for command
	-vv --assert=plain (exited with code 1)
	py37-normal-normal-nocov cannot reuse: no previous config
	___________________________________ summary ____________________________________
	ERROR:	 py27-normal-normal-nocov: commands failed
	py37-normal-normal-nocov: commands succeeded

	+ xvfb-run sh makedocs
	_XSERVTransmkdir: ERROR: euid != 0,directory /tmp/.X11-unix will not be created.
	The XKEYBOARD keymap compiler (xkbcomp) reports:
	error: Couldn't open X11 display
	The full traceback has been saved in /usr/src/tmp/sphinx-err-QqFDhz.log, if you want
	to report the issue to the developers.

	gcc -pipe -frecord-gcc-switches -Wall -g -O3 -DUNIX -o unarj unarj.o decode.o environ.o
	x86_64-alt-linux-gcc: error: unarj.o: No such file or directory
	make: *** [Makefile:10: unarj] Error 1

	Running unix-from-socket-http... ok
	Running unix-guile... FAILED: ;;; note: auto-compilation is enabled, set
	;;;	  or pass the --no-auto-compile argument to disable.

	5 error logs REMOVED from the list

Total 54 error logs.

Подробная информация о списке рассылки Sisyphus-cybertalk