[cyber] I: Sisyphus-20190417 x86_64 beehive_status: +13 -5 (65)

ALT beekeeper hiver altlinux.org
17 10:08:51 MSK 2019


	13 NEW error logs

SPICE-0.14.1-alt2
	File "<string>", line 22, in <module>
	ImportError: No module named distutils
	checking for python extension module directory... Traceback (most recent call last):
	File "<string>", line 22, in <module>
	ImportError: No module named distutils
	checking for pixman-1 >= 0.17.7... yes
	--
	generated_server_demarshallers.c: In function 'parse_msgc_tunnel_service_add':
	generated_server_demarshallers.c:1499:28: error: 'SPICE_TUNNEL_SERVICE_TYPE_IPP'
	undeclared (first use in this function); did you mean 'SPICE_VIDEO_CODEC_TYPE_VP9'?
	if (type__value == SPICE_TUNNEL_SERVICE_TYPE_IPP) {
	--
	generated_server_demarshallers.c:1499:28: note: each undeclared identifier is reported
	only once for each function it appears in
	generated_server_demarshallers.c:1510:36: error: 'SPICE_TUNNEL_IP_TYPE_IPv4' undeclared
	(first use in this function); did you mean 'SPICE_CLIP_TYPE_NONE'?
	if (type__value == SPICE_TUNNEL_IP_TYPE_IPv4) {
	--
	generated_server_marshallers.c: In function 'spice_marshall_msg_tunnel_service_ip_map':
	generated_server_marshallers.c:1283:37: error: 'SPICE_TUNNEL_IP_TYPE_IPv4' undeclared
	(first use in this function); did you mean 'SPICE_CLIP_TYPE_NONE'?
	if (src->virtual_ip.type == SPICE_TUNNEL_IP_TYPE_IPv4) {

jed-2:0.99.19-alt2.qa2.1
	/usr/bin/ld.default: sysdep.o: file not recognized: file truncated
	collect2: error: ld returned 1 exit status
	make[1]: *** [Makefile:157: /usr/src/RPM/BUILD/jed-0.99-19/src/objs/jed] Error 1

libspice-gtk-0.36-alt1
	[17/139] Compiling C object
	'subprojects/spice-common/common/4ed40af@@spice-common-client  sta/meson-generated_.._generated_client_marshallers.c.o'.
	FAILED:
	subprojects/spice-common/common/4ed40af@@spice-common-client  sta/meson-generated_.._generated_client_marshallers.c.o
	cc -Isubprojects/spice-common/common/4ed40af@@spice-common-client  sta
	-Isubprojects/spice-common/common -I../subprojects/spice-common/common
	-Isubprojects/spice-common -I../subprojects/spice-common -I/usr/include/spice-1
	-I/usr/include/glib-2.0 -I/usr/lib64/glib-2.0/include -I/usr/include/pixman-1
	-I/usr/include/opus -I/usr/include/cacard -fdiagnostics-color=always -pipe
	-D_FILE_OFFSET_BITS=64 -DHAVE_CONFIG_H '-DG_LOG_DOMAIN="Spice"' -Wall -Wextra
	-Werror -Wno-unused-parameter -DGLIB_VERSION_MIN_REQUIRED=GLIB_VERSION_2_38
	-DGLIB_VERSION_MAX_ALLOWED=GLIB_VERSION_2_38
	-frecord-gcc-switches -Wall -g -O2 -fPIC -pthread  -MD -MQ
	'subprojects/spice-common/common/4ed40af@@spice-common-client  sta/meson-generated_.._generated_client_marshallers.c.o'
	-MF
	'subprojects/spice-common/common/4ed40af@@spice-common-client  sta/meson-generated_.._generated_client_marshallers.c.o.d'
	-o
	'subprojects/spice-common/common/4ed40af@@spice-common-client  sta/meson-generated_.._generated_client_marshallers.c.o'
	-c subprojects/spice-common/common/generated_client_marshallers.c
	subprojects/spice-common/common/generated_client_marshallers.c: In function
	‘spice_marshall_msgc_tunnel_service_add’:
	subprojects/spice-common/common/generated_client_marshallers.c:303:22: error:
	‘SPICE_TUNNEL_SERVICE_TYPE_IPP’ undeclared (first use in this function); did you
	mean ‘SPICE_VIDEO_CODEC_TYPE_VP9’?
	if (src->type == SPICE_TUNNEL_SERVICE_TYPE_IPP) {
	--
	subprojects/spice-common/common/generated_client_marshallers.c:303:22: note: each
	undeclared identifier is reported only once for each function it appears in
	subprojects/spice-common/common/generated_client_marshallers.c:306:31: error:
	‘SPICE_TUNNEL_IP_TYPE_IPv4’ undeclared (first use in this function); did you mean
	‘SPICE_CLIP_TYPE_NONE’?
	if (src->u.ip.type == SPICE_TUNNEL_IP_TYPE_IPv4) {
	--
	[18/139] Compiling C object
	'subprojects/spice-common/common/4ed40af@@spice-common-client  sta/meson-generated_.._generated_client_demarshallers.c.o'.
	FAILED:
	subprojects/spice-common/common/4ed40af@@spice-common-client  sta/meson-generated_.._generated_client_demarshallers.c.o
	cc -Isubprojects/spice-common/common/4ed40af@@spice-common-client  sta
	-Isubprojects/spice-common/common -I../subprojects/spice-common/common
	-Isubprojects/spice-common -I../subprojects/spice-common -I/usr/include/spice-1
	-I/usr/include/glib-2.0 -I/usr/lib64/glib-2.0/include -I/usr/include/pixman-1
	-I/usr/include/opus -I/usr/include/cacard -fdiagnostics-color=always -pipe
	-D_FILE_OFFSET_BITS=64 -DHAVE_CONFIG_H '-DG_LOG_DOMAIN="Spice"' -Wall -Wextra
	-Werror -Wno-unused-parameter -DGLIB_VERSION_MIN_REQUIRED=GLIB_VERSION_2_38
	-DGLIB_VERSION_MAX_ALLOWED=GLIB_VERSION_2_38
	-frecord-gcc-switches -Wall -g -O2 -fPIC -pthread  -MD -MQ
	'subprojects/spice-common/common/4ed40af@@spice-common-client  sta/meson-generated_.._generated_client_demarshallers.c.o'
	-MF
	'subprojects/spice-common/common/4ed40af@@spice-common-client  sta/meson-generated_.._generated_client_demarshallers.c.o.d'
	-o
	'subprojects/spice-common/common/4ed40af@@spice-common-client  sta/meson-generated_.._generated_client_demarshallers.c.o'
	-c subprojects/spice-common/common/generated_client_demarshallers.c
	subprojects/spice-common/common/generated_client_demarshallers.c: In function
	‘parse_msg_tunnel_service_ip_map’:
	subprojects/spice-common/common/generated_client_demarshallers.c:7389:32: error:
	‘SPICE_TUNNEL_IP_TYPE_IPv4’ undeclared (first use in this function); did you mean
	‘SPICE_CLIP_TYPE_NONE’?
	if (type__value == SPICE_TUNNEL_IP_TYPE_IPv4) {

meschach-1.2-alt1.b.3
	Verifying ELF objects in /usr/src/tmp/meschach-buildroot
	(arch=normal,fhs=normal,lfs=relaxed,lint=relaxed,rpath=normal,stack=normal,textrel=normal,unresolved=normal)
	verify-elf: ERROR: ./usr/lib64/libmeschach.so.0: undefined symbol: bd_free
	verify-elf: ERROR: ./usr/lib64/libmeschach.so.0: undefined symbol: Usolve
	verify-elf: ERROR: ./usr/lib64/libmeschach.so.0: undefined symbol: trieig
	verify-elf: ERROR: ./usr/lib64/libmeschach.so.0: undefined symbol: square
	verify-elf: ERROR: ./usr/lib64/libmeschach.so.0: undefined symbol: rot_vec
	verify-elf: ERROR: ./usr/lib64/libmeschach.so.0: undefined symbol: givens
	verify-elf: ERROR: ./usr/lib64/libmeschach.so.0: undefined symbol: _v_norm2

perl-Convert-PEM-0.08-alt1
	Possible precedence issue with control flow operator at
	/usr/src/RPM/BUILD/Convert-PEM-0.08/inc/Test/Builder.pm line 858.
	#   Failed test 'errstr matches decrypt failed'
	#   at t/02-encode.t line 28.
	--
	t/02-encode.t	(Wstat: 256 Tests: 9 Failed: 1)
	Failed test:  6
	Non-zero exit status: 1
	--
	Result: FAIL
	Failed 1/5 test programs. 1/36 subtests failed.
	make: *** [Makefile:780: test_dynamic] Error 255

perl-Crypt-Primes-0.50-alt2.1
	Result: FAIL
	Failed 1/3 test programs. 0/26 subtests failed.
	make: *** [Makefile:790: test_dynamic] Error 255

pve-spiceterm-3.0.5-alt1
	generated_server_demarshallers.c: In function 'parse_msgc_tunnel_service_add':
	generated_server_demarshallers.c:1499:28: error: 'SPICE_TUNNEL_SERVICE_TYPE_IPP'
	undeclared (first use in this function); did you mean 'SPICE_VIDEO_CODEC_TYPE_VP9'?
	if (type__value == SPICE_TUNNEL_SERVICE_TYPE_IPP) {
	--
	generated_server_demarshallers.c:1499:28: note: each undeclared identifier is reported
	only once for each function it appears in
	generated_server_demarshallers.c:1510:36: error: 'SPICE_TUNNEL_IP_TYPE_IPv4' undeclared
	(first use in this function); did you mean 'SPICE_CLIP_TYPE_NONE'?
	if (type__value == SPICE_TUNNEL_IP_TYPE_IPv4) {

python-module-argcomplete-1.9.4-alt2
	test_wordbreak_chars (__main__.TestTcsh) ... ok
	FAIL: test_parse_special_characters_dollar (__main__.TestBashGlobal)
	Traceback (most recent call last):
	--
	self.sh.run_command('exit')
	AssertionError: EOF not raised
	Ran 116 tests in 152.094s
	FAILED (failures=1, expected failures=10)
	ERROR: InvocationError for command
	'/usr/src/RPM/BUILD/argcomplete-1.9.4/.tox/py36/bin/python test/test.py -v' (exited
	with code 1)
	✖ FAIL py36 in 2 minutes, 45.843 seconds
	--
	py27: commands succeeded
	ERROR:	 py36: parallel child exit code 1

python-module-flake8-3.7.7-alt1
	No data to combine
	ERROR: InvocationError for command
	'/usr/src/RPM/BUILD/python-module-flake8-3.7.7/.tox/py36/bin/coverage combine' (exited
	with code 1)
	✖ FAIL py36 in 26.284 seconds
	--
	py27: commands succeeded
	ERROR:	 py36: parallel child exit code 1

python-module-jupyter_console-5.2.0-alt1.1
	nose.plugins.cover: INFO: Coverage report will include only packages: ['jupyter_console']
	test that `jupyter console` starts a terminal ... ERROR
	jupyter console --help-all works ... ok
	--
	test_handle_image_tempfile
	(jupyter_console.tests.test_image_handler.ZMQTerminalInteractiveShellTestCase) ... ok
	ERROR: test that `jupyter console` starts a terminal
	Traceback (most recent call last):
	--
	Ran 9 tests in 69.011s
	FAILED (errors=1)

python3-3.6.8-alt1
	20 tests skipped:
	test_curses test_devpoll test_kqueue test_msilib test_nis
	test_ossaudiodev test_smtpnet test_socketserver test_startfile
	test_timeout test_tix test_tk test_ttk_guionly test_urllib2net
	test_urllibnet test_winconsoleio test_winreg test_winsound
	test_xmlrpc_net test_zipfile64
	2 tests run no tests:
	test_dtrace test_future4
	Total duration: 3 min 21 sec
	Tests result: FAILURE

sgc-0.2.1-alt3
	+ xvfb-run sh makedocs
	_XSERVTransmkdir: ERROR: euid != 0,directory /tmp/.X11-unix will not be created.
	The XKEYBOARD keymap compiler (xkbcomp) reports:
	--
	pygame.display.init()
	error: Couldn't open X11 display
	The full traceback has been saved in /usr/src/tmp/sphinx-err-y5FVkV.log, if you want
	to report the issue to the developers.

xblas-1.0.248-alt1.2
	/usr/bin/ld.default: ../test-symv2/BLAS_symv2_testgen.o: file not recognized: file
	truncated
	collect2: error: ld returned 1 exit status
	make[1]: *** [Makefile:40: do_test_hemv2] Error 1

	5 error logs REMOVED from the list
dopewars-1.5.12-alt1_20.1033svn
gnome-disk-utility-3.32.1-alt1
littleproxy-1.1.0-alt2_3jpp8
musescore-2.3.2-alt1
sbcl-1.4.12-alt3

Total 65 error logs.


Sisyphus-cybertalk