[cyber] I: Sisyphus-20181029 x86_64 beehive_status: +6 -40 (363)

ALT beekeeper hiver altlinux.org
29 10:00:30 MSK 2018


	6 NEW error logs

archivemail-0.9.0-alt1
	................................................F..................................................
	FAIL: testJustOld (__main__.TestIsTooOld)
	with max_days=1, should be true for these dates >= 1 day
	--
	Ran 99 tests in 2.460s
	FAILED (failures=1)

lshw-2.18-alt1
	./core//liblshw.a(cdrom.o): In function `scan_cdrom(hwNode&)':
	/usr/src/RPM/BUILD/lshw-B.02.18/src/core/cdrom.cc:116: undefined reference to
	`scan_partitions(hwNode&)'
	./core//liblshw.a(disk.o): In function `scan_disk(hwNode&)':
	/usr/src/RPM/BUILD/lshw-B.02.18/src/core/disk.cc:79: undefined reference to
	`scan_partitions(hwNode&)'
	collect2: error: ld returned 1 exit status
	make[1]: *** [Makefile:54: lshw] Error 1

perl-IO-Event-0.813-alt2
	Result: FAIL
	Failed 1/12 test programs. 0/920 subtests failed.
	make: *** [Makefile:780: test_dynamic] Error 255

python-module-pexpect-4.6-alt1
	>	self.assertEqual(child.exitstatus, 0)
	E	AssertionError: None != 0
	tests/test_env.py:68: AssertionError

spl-0.7.11-alt1
	+ /bin/mkdir -p /usr/src/RPM/BUILD
	+ cd /usr/src/RPM/BUILD
	+ rm -rf spl-0.7.11
	+ echo 'Source #0 (spl-0.7.11.tar):'
	Source #0 (spl-0.7.11.tar):
	+ /bin/tar -xf /usr/src/RPM/SOURCES/spl-0.7.11.tar
	+ cd spl-0.7.11
	+ /bin/chmod -c -Rf u+rwX,go-w .
	+ tar -C .. --exclude .gitignore -cJf spl-0.7.11.tar.xz .
	tar: ./spl-0.7.11: file changed as we read it

transgui-5.15.4-alt1.S1
	$0000000000585713
	$0000000000605C1C
	$0000,29) Подсказка: (5024) Паpаметp "Sender" не использyется
	(1008) 1885 строк скомпилиpовано, 0.3 сек.
	(1022) 4 подсказок
	000000404218
	$0000000000403B46
	$0000000000401D15
	$0000000000407705
	$000000000040A39F

	40 error logs REMOVED from the list
automake_1.11-1.11.6-alt8
environment-modules-3.2.10-alt1_23.qa1
gawk-4.1.0-alt2
golang-github-xtaci-smux-1.0.7-alt1_1
gst-plugins-espeak1.0-0.5.0-alt1
jed-2:0.99.19-alt2.qa2.1
libgtk-engine-smooth-1:2.14.3-alt2_2
libldm-0.2.3-alt1_6
libofetion-2.2.2-alt1_9
libsmi-0.4.8-alt2.2
libsnark-supercop-20141014-alt1_4
lz4-1:1.8.3-alt1
oddjob-0.34.4-alt2
osslsigncode-1.7.1-alt1_2
perl-Class-Base-0.09-alt1
perl-Class-DBI-3.0.17-alt2
perl-Crypt-SSLeay-0.72-alt2.1
perl-CryptX-0.061-alt1
perl-DBI-1.641-alt1
perl-DBIx-Class-0.082841-alt1
perl-Dancer2-0.206000-alt1
perl-Event-Lib-1.03-alt5.1.1.1.1
perl-Net-Ping-2.71-alt1
perl-Net-Z3950-ZOOM-1.30-alt1.1.1.1
perl-SGML-Parser-OpenSP-0.994-alt3.1.1.1.1
python-module-aiorwlock-0.4.0-alt1.1
python-module-flake8-print-2.0.2-alt1.1
python-module-funcsigs-1.0.2-alt1.1
python-module-gssapi-1.5.1-alt1
python-module-lesscpy-0.13.0-alt1
python-module-pytest-flake8-1.0.2-alt1
python-module-scikits.fitting-1:0.6-alt2
python-module-setuptools-1:40.4.3-alt1.qa1
python-module-tinycss2-0.6.1-alt1.1
python-module-zdaemon-4.2.0-alt1
quilt-0.65.0.27.0f2a-alt1
rex-1.6.0-alt1
sgc-0.2.1-alt1
systemd-1:239-alt2
zfs-0.7.11-alt1

Total 363 error logs.


Sisyphus-cybertalk