[cyber] I: Sisyphus-20181022 x86_64 beehive_status: +11 -22 (392)

ALT beekeeper hiver altlinux.org
22 09:22:57 MSK 2018


	11 NEW error logs

atlas-3.9.35-alt1.qa1
	make[2]: Leaving directory '/usr/src/RPM/BUILD/ATLAS/BUILD/bin'
	ERROR 845 DURING CACHE EDGE DETECTION!!.
	make[2]: Entering directory '/usr/src/RPM/BUILD/ATLAS/BUILD/bin'
	--
	gcc -V 2>&1  >> bin/INSTALL_LOG/ERROR.LOG
	x86_64-alt-linux-gcc: error: unrecognized command line option '-V'
	x86_64-alt-linux-gcc: fatal error: no input files
	compilation terminated.
	--
	directory.  Be sure to include this file in any help request.
	cat: ../../CONFIG/error.txt: No such file or directory
	ForceFetch=1, ifetch=5 nfetch=1

crlibm-1.0beta4-alt2
	[152]
	! Package inputenc Error: Invalid UTF-8 byte 178.
	See the inputenc package documentation for explanation.
	--
	Transcript written on crlibm.log.
	mv: cannot stat 'crlibm.pdf': No such file or directory
	make: *** [Makefile:1089: crlibm.pdf] Error 1

gawk-4.1.0-alt2
	make[2]: Entering directory '/usr/src/RPM/BUILD/gawk-4.1.0-alt2/test'
	1 TESTS FAILED
	make[2]: *** [Makefile:3646: pass-fail] Error 1

holotz-castle-1.3.14-alt2.qa1
	/usr/bin/ld.default: cannot find -lJLib
	collect2: error: ld returned 1 exit status
	mv: cannot stat 'HC': No such file or directory
	make[1]: *** [Makefile:57: HC] Error 1

meschach-1.2-alt1.b.3
	Verifying ELF objects in /usr/src/tmp/meschach-buildroot
	(arch=normal,fhs=normal,lfs=relaxed,lint=relaxed,rpath=normal,stack=normal,textrel=normal,unresolved=normal)
	verify-elf: ERROR: ./usr/lib64/libmeschach.so.0: undefined symbol: _zv_copy
	verify-elf: ERROR: ./usr/lib64/libmeschach.so.0: undefined symbol: zv_zero
	verify-elf: ERROR: ./usr/lib64/libmeschach.so.0: undefined symbol: zadd
	verify-elf: ERROR: ./usr/lib64/libmeschach.so.0: undefined symbol: zv_resize
	verify-elf: ERROR: ./usr/lib64/libmeschach.so.0: undefined symbol: zsqrt
	verify-elf: ERROR: ./usr/lib64/libmeschach.so.0: undefined symbol: _zm_copy
	verify-elf: ERROR: ./usr/lib64/libmeschach.so.0: undefined symbol: _zv_norm2
	verify-elf: ERROR: ./usr/lib64/libmeschach.so.0: undefined symbol: zget_col
	verify-elf: ERROR: ./usr/lib64/libmeschach.so.0: undefined symbol: __zzero__
	verify-elf: ERROR: ./usr/lib64/libmeschach.so.0: undefined symbol: _zin_prod

opencc-1.0.5-alt1.qa1
	[ 72%] Building TWVariantsRevPhrases.ocd
	make[2]: Leaving directory '/usr/src/RPM/BUILD/opencc-1.0.5/BUILD'
	make[2]: Entering directory '/usr/src/RPM/BUILD/opencc-1.0.5/BUILD'
	[ 76%] Building HKVariants.ocd
	make[2]: Leaving directory '/usr/src/RPM/BUILD/opencc-1.0.5/BUILD'
	make[2]: Entering directory '/usr/src/RPM/BUILD/opencc-1.0.5/BUILD'
	[ 60%] Building STPhrases.ocd
	make[2]: Leaving directory '/usr/src/RPM/BUILD/opencc-1.0.5/BUILD'
	make[1]: *** [CMakeFiles/Makefile2:1228: data/CMakeFiles/Dictionaries.dir/all] Error 2
	make: *** [Makefile:163: all] Error 2

perl-Devel-Cover-1.31-alt1
	t/e2e/eval_use.t ............ ok
	#   Failed test 'output'
	#   at /usr/src/RPM/BUILD/Devel-Cover-1.31/blib/lib/Devel/Cover/Test.pm line 306.
	--
	t/e2e/md5.t		  (Wstat: 256 Tests: 1 Failed: 1)
	Failed test:  1
	Non-zero exit status: 1
	--
	Result: FAIL
	Failed 1/78 test programs. 1/86 subtests failed.
	make: *** [Makefile:1039: test_dynamic] Error 255

python-module-joblib-0.11-alt2
	joblib/test/test_parallel.py::test_no_blas_crash_or_freeze_with_multiprocessing SKIPPED
	[ 97%]
	joblib/test/test_parallel.py::test_parallel_with_interactively_defined_functions FAILED
	[ 97%]
	joblib/test/test_parallel.py::test_parallel_with_exhausted_iterator PASSED [ 97%]
	--
	>		raise ValueError(message)
	E		ValueError: Non-zero return code: -9.
	E		Stdout:

python-module-sybil-1.0.9-alt1.qa1
	tests/test_doctest.py::test_tabs PASSED					 [ 55%]
	tests/test_functional.py::test_pytest FAILED				 [ 57%]
	tests/test_functional.py::test_unittest PASSED				 [ 59%]
	--
	'x is currently: 0\n'
	'FAILED function_fixture teardown\n'
	'class_fixture teardown')
	--
	self = <tests.test_functional.Finder object at 0x7f923d08f4d0>
	substring = 'fail.rst sybil setup session_fixture setup\nmodule_fixture
	setup\nclass_fixture setup\nfunction_fixture setup\nx is currently: 0\nFAILED
	function_fixture teardown\nclass_fixture teardown'
	def then_find(self, substring):
	>	assert substring in self.text[self.index:]
	E	AssertionError: assert 'fail.rst sybil setup session_fixture setup\nmodule_fixture
	setup\nclass_fixture setup\nfunction_fixture setup\nx is currently: 0\nFAILED
	function_fixture teardown\nclass_fixture teardown' in 'fail.rst::line:1,column:1
	sybil setup session_fixture setup\nmodule_fixture setup\nclass_fixture
	setup\nfunction_fixture...tional/pytest/fail.rst:18: Exception\n======================
	4 failed, 6 passed in 0.16 seconds ======================\n'
	tests/test_functional.py:19: AssertionError

razor-2.85-alt4.1.1.1
	blib/man5/razor-whitelist.5
	Can't write-open blib/man5/razor-agent.conf.5: No such file or directory at
	/usr/share/perl5/ExtUtils/Command/MM.pm line 153.
	Manifying 3 pod documents

transgui-5.15.4-alt1.S1
	$0000000000585713
	$0000000000605C1C
	$0000,29) Подсказка: (5024) Паpаметp "Sender" не использyется
	(1008) 1885 строк скомпилиpовано, 0.5 сек.
	(1022) 4 подсказок
	000000404218
	$0000000000403B46
	$0000000000401D15
	$0000000000407705
	$000000000040A39F

	22 error logs REMOVED from the list
Mesa-4:18.2.2-alt0.dummy
apache2-mod_nss-1.0.17-alt3
archivemail-0.9.0-alt1
aws-sdk-java-1.11.3-alt1_5jpp8
cilk-5.4.6-alt11
cinnamon-control-center-3.8.2-alt1
fortranposix-0.1.1-alt1
gdm-3.30.1-alt1
gromacs-4.0.7-alt8
intercal-0.29-alt1.git20140828.1
lz4-1:1.8.3-alt1
perl-IO-Event-0.813-alt2
python-module-pexpect-4.6-alt1
python-module-pyjenkins-0.4.8-alt1.git20150810.2
python-module-pytest-3.8.2-alt1
python-module-terminado-0.5-alt1.git20150717.2.1
qt4-webkit-1:2.3.4-alt5
racket-6.10.1-alt1
sdcv-0.5.2-alt1
texlive-2017-alt2_4
zopfli-1.0.2-alt2
zstd-1.3.5-alt1

Total 392 error logs.


Sisyphus-cybertalk