[cyber] I: Sisyphus-20181008 x86_64 beehive_status: +12 -10 (446)

ALT beekeeper hiver altlinux.org
8 08:59:24 MSK 2018


	12 NEW error logs

apr1-1.5.2-alt1
	.libs/sendfile.o: file not recognized: File truncated
	collect2: error: ld returned 1 exit status
	make[1]: *** [Makefile:104: sendfile] Error 1

archivemail-0.9.0-alt1
	................................................F..................................................
	FAIL: testJustOld (__main__.TestIsTooOld)
	with max_days=1, should be true for these dates >= 1 day
	--
	Ran 99 tests in 2.240s
	FAILED (failures=1)

automake_1.11-1.11.6-alt8
	make[3]: Entering directory '/usr/src/RPM/BUILD/automake-1.11.6-alt8/tests'
	FAIL: ar-lib4.test
	make[3]: Leaving directory '/usr/src/RPM/BUILD/automake-1.11.6-alt8/tests'
	--
	make[3]: Entering directory '/usr/src/RPM/BUILD/automake-1.11.6-alt8/tests'
	1 of 893 tests failed
	(58 tests were not run)

neko-2.2.0-alt1
	/usr/src/RPM/BUILD/neko-2.2.0/nekotools.c:105:13: warning: 'handle_signal' defined but
	not used [-Wunused-function]
	static void handle_signal( int signal ) {
	make[2]: Leaving directory '/usr/src/RPM/BUILD/neko-2.2.0'
	make[2]: Entering directory '/usr/src/RPM/BUILD/neko-2.2.0'
	[100%] Linking C executable bin/nekotools
	make[2]: Leaving directory '/usr/src/RPM/BUILD/neko-2.2.0'
	make[1]: Entering directory '/usr/src/RPM/BUILD/neko-2.2.0'
	[100%] Built target nekotools
	make[1]: Leaving directory '/usr/src/RPM/BUILD/neko-2.2.0'
	make: *** [Makefile:163: all] Error 2

opennebula-5.6.1-alt1
	gyp ERR! configure error
	gyp ERR! stack Error: This is most likely not a problem with node-gyp or the package
	itself and
	gyp ERR! stack is related to network connectivity. In most cases you are behind a proxy
	or have bad

perl-Glib-1.327-alt1
	t/9.t			 (Wstat: 0 Tests: 30 Failed: 2)
	Failed tests:  29-30
	Files=33, Tests=1177, 39 wallclock secs ( 0.20 usr  0.07 sys +	4.14 cusr  0.43 csys =
	4.84 CPU)
	Result: FAIL
	Failed 1/33 test programs. 2/1177 subtests failed.
	make: *** [Makefile:1104: test_dynamic] Error 255

python-module-joblib-0.11-alt2
	joblib/test/test_parallel.py::test_no_blas_crash_or_freeze_with_multiprocessing PASSED
	[ 97%]
	joblib/test/test_parallel.py::test_parallel_with_interactively_defined_functions FAILED
	[ 97%]
	joblib/test/test_parallel.py::test_parallel_with_exhausted_iterator PASSED [ 97%]
	--
	>		raise ValueError(message)
	E		ValueError: Non-zero return code: -9.
	E		Stdout:

sbcl-1.4.12-alt1
	21	0   0.0   1516 100.0   1516 100.0	 -  (FLET SB-UNIX::BODY :IN
	SAVE-LISP-AND-DIE)
	22	0   0.0   1516 100.0   1516 100.0	 -  (FLET "WITHOUT-INTERRUPTS-BODY-27"
	:IN SAVE-LISP-AND-DIE)
	23	0   0.0   1516 100.0   1516 100.0	 -  (LABELS SB-IMPL::RESTART-LISP :IN
	SAVE-LISP-AND-DIE)
	24	0   0.0    149	 9.8   1516 100.0	 -  "foreign function
	interrupt_handle_pending"
	25	0   0.0    149	 9.8   1516 100.0	 -  "foreign function handle_trap"
	0   0.0					    elsewhere
	* make: Leaving directory '/usr/src/RPM/BUILD/sbcl-1.4.12/sbcl-1.4.12/contrib/sb-sprof'
	WARNING! Some of the contrib modules did not build successfully or pass
	their self-tests. Failed contribs:"
	sb-concurrency

sdcv-0.5.2-alt1
	10/10 Test  #7: t_interactive ....................   Passed    5.01 sec
	90% tests passed, 1 tests failed out of 10
	Total Test time (real) =   5.03 sec
	The following tests FAILED:
	1 - t_list (Failed)

spl-0.7.11-alt1
	+ /bin/mkdir -p /usr/src/RPM/BUILD
	+ cd /usr/src/RPM/BUILD
	+ rm -rf spl-0.7.11
	+ echo 'Source #0 (spl-0.7.11.tar):'
	Source #0 (spl-0.7.11.tar):
	+ /bin/tar -xf /usr/src/RPM/SOURCES/spl-0.7.11.tar
	+ cd spl-0.7.11
	+ /bin/chmod -c -Rf u+rwX,go-w .
	+ tar -C .. --exclude .gitignore -cJf spl-0.7.11.tar.xz .
	tar: ./spl-0.7.11: file changed as we read it

ted-2.23-alt1
	Checking for Motif...
	checking for socket... yes
	checking for strerror... yes
	checking for uname... yes
	Choosing a GUI...
	Choosing GTK ...
	configure: creating ./config.status
	config.status: creating makefile
	config.status: creating tedConfig.h
	make: Leaving directory '/usr/src/RPM/BUILD/Ted-2.23'

transgui-5.15.4-alt1.S1
	(3104) Компиляция trcomp.pas
	(3104) Компиляция vargrid.pas
	(3104) Компиляция varlist.pas
	/usr/src/RPM/BUILD/transgui-5.15.4/vargrid.pas(93,28) Подсказка: (5024)
	Паpаметp "Sender" не использyется
	/usr/src/RPM/BUILD/transgui-5.15.4/vargrid.pas(107An unhandled exception occurred at
	$000000000053DF03:
	EAccessViolation: Access violation
	$000000000053DF03
	$0000000000575E75
	$0000000000579F37
	$000000000057B141

	10 error logs REMOVED from the list
golang-github-xtaci-smux-1.0.7-alt1_1
holotz-castle-1.3.14-alt2.qa1
jed-2:0.99.19-alt2.qa2.1
libsearpc-3.1-alt2
meson-0.47.2-alt1
openscada-0.9.0-alt1
perl-HTTP-Proxy-0.304-alt2
qslave-1.0.2-alt3.S1
qstopmotion-2.3.2-alt1
squeak-vm-4.10.2.2614-alt3_8

Total 446 error logs.


Sisyphus-cybertalk