[cyber] I: Sisyphus-20181005 x86_64 beehive_status: +21 -12 (459)

ALT beekeeper hiver altlinux.org
5 14:31:24 MSK 2018


	21 NEW error logs

cinnamon-control-center-3.8.2-alt1
	CC	 cc-datetime-panel.lo
	cc-datetime-panel.c:27:10: fatal error: cc-dtm-proxy.h: No such file or directory
	#include "cc-dtm-proxy.h"

e-uae-0.8.29-alt1
	build68k.o: file not recognized: File truncated
	collect2: error: ld returned 1 exit status
	make[2]: *** [Makefile:45: build68k] Error 1
	--
	build68k.o: file not recognized: File truncated
	collect2: error: ld returned 1 exit status
	make[2]: *** [Makefile:45: build68k] Error 1

gear-2.2.0-alt1
	tests passed:	  356  99%
	tests failed:	    1	0%
	tests skipped:	    0	0%

gettext-0.19.8.1-alt5
	# SKIP:  19
	# XFAIL: 0
	# FAIL:  0
	# XPASS: 0
	# ERROR: 0
	make[7]: Leaving directory '/usr/src/RPM/BUILD/gettext-0.19.8.1/gettext-tools/gnulib-tests'

jed-2:0.99.19-alt2.qa2.1
	sysdep.o: file not recognized: File truncated
	collect2: error: ld returned 1 exit status
	make[1]: *** [Makefile:157: /usr/src/RPM/BUILD/jed-0.99-19/src/objs/jed] Error 1

libnatspec-0.3.1-alt2
	Making all in tests
	hasher-priv: master: idle time limit (3600 seconds) exceeded

libsigrok-0.5.0-alt2
	from xml.etree import ElementTree
	ImportError: No module named xml.etree
	make[1]: *** [Makefile:3945: bindings/cxx/enums.timestamp] Error 1

mpc-0.30-alt1
	[21/22] Generating HTML documentation with a custom command.
	FAILED: doc/html
	/usr/bin/sphinx-build-3 -q -b html -d doc/doctrees /usr/src/RPM/BUILD/mpc-0.30/doc doc/html
	--
	doctree = pickle.load(f)
	_pickle.UnpicklingError: pickle data was truncated
	The full traceback has been saved in /usr/src/tmp/sphinx-err-vi5f5q0i.log, if you want
	to report the issue to the developers.

perl-HTTP-Proxy-0.304-alt2
	# socket is non blocking, switching to blocking mode
	#   Failed test 'Read some data from the socket'
	#   at t/23connect.t line 79.
	#   Failed test 'CONNECTed to the TCP server and got the banner'
	#   at t/23connect.t line 80.
	--
	t/23connect.t		(Wstat: 0 Tests: 4 Failed: 2)
	Failed tests:  2-3
	Files=37, Tests=465, 13 wallclock secs ( 0.16 usr  0.05 sys +  6.78 cusr  0.84 csys =
	7.83 CPU)
	Result: FAIL
	Failed 1/37 test programs. 2/465 subtests failed.
	make: *** [Makefile:792: test_dynamic] Error 255

python-module-matplotlib-2.0.0-alt7.1
	if self.version < other.version:
	TypeError: '<' not supported between instances of 'str' and 'int'
	error: Bad exit status from /usr/src/tmp/rpm-tmp.22466 (%build)

pyzy-0.1.0-alt3
	from valid_hanzi import *
	LookupError: no codec search functions registered: can't find encoding
	make[4]: Entering directory '/usr/src/RPM/BUILD/pyzy-0.1.0/data/db/android'
	--
	from valid_hanzi import *
	LookupError: no codec search functions registered: can't find encoding
	test -z "/usr/share/pyzy/db" || /bin/mkdir -p
	"/usr/src/tmp/pyzy-buildroot/usr/share/pyzy/db"
	/bin/install -p -m 644 ./android.db '/usr/src/tmp/pyzy-buildroot/usr/share/pyzy/db'
	/bin/install: cannot stat './android.db': No such file or directory
	make[4]: *** [Makefile:333: install-main_dbDATA] Error 1

qt4-webkit-1:2.3.4-alt5
	from xml.dom import minidom
	ImportError: No module named xml.dom
	make[3]: *** [Makefile.JavaScriptCore.DerivedSources:1969: generated/udis86_itab.c] Error 1

racket-6.10.1-alt1
	raco setup: 6 rendering: <pkgs>/gui-doc/mrlib/scribblings/mrlib.scrbl
	raco setup: 2 rendering: <pkgs>/mysterx/scribblings/mysterx.scrbl
	raco setup: 2 rendering: <pkgs>/mzcom/mzcom.scrbl
	raco setup: 2 rendering: <pkgs>/compatibility-doc/mzlib/scribblings/mzlib.scrbl
	raco setup: 6 rendering: <pkgs>/mzscheme-doc/mzscheme/mzscheme.scrbl
	raco setup: 6 rendering: <pkgs>/net-doc/net/scribblings/net.scrbl
	raco setup: 2 rendering: <pkgs>/racket-doc/openssl/openssl.scrbl
	make[1]: *** [Makefile:178: install-3m] CPU time limit exceeded
	make[1]: Leaving directory '/usr/src/RPM/BUILD/racket-6.10.1/src'
	make: *** [Makefile:103: install] Error 2

razor-2.85-alt4.1.1.1
	blib/man5/razor-whitelist.5
	Can't write-open blib/man5/razor-agent.conf.5: No such file or directory at
	/usr/share/perl5/ExtUtils/Command/MM.pm line 153.
	Manifying 3 pod documents

realmd-0.16.3-alt1.S1
	import argparse
	ImportError: No module named argparse
	make[4]: *** [Makefile:2957: test-ini-config.log] Error 1
	--
	import argparse
	ImportError: No module named argparse
	make[4]: *** [Makefile:2978: test-login-name.log] Error 1
	--
	import argparse
	ImportError: No module named argparse
	make[4]: *** [Makefile:2950: test-dn-util.log] Error 1
	--
	import argparse
	ImportError: No module named argparse
	make[4]: *** [Makefile:2971: test-safe-format.log] Error 1
	--
	import argparse
	ImportError: No module named argparse
	make[4]: *** [Makefile:2964: test-sssd-config.log] Error 1
	--
	import argparse
	ImportError: No module named argparse
	make[4]: *** [Makefile:2985: test-settings.log] Error 1

ruby-gnome2-3.2.9-alt1
	make: Entering directory '/usr/src/RPM/BUILD/ruby-gnome2-3.2.9/glib2'
	make: *** No rule to make target 'install'.  Stop.
	make: Leaving directory '/usr/src/RPM/BUILD/ruby-gnome2-3.2.9/glib2'

samba-DC-4.8.5-alt2.S1
	Selected version libldb-devel#1.3.6-alt1.S1 for libldb-devel>=1.3.6
	E: Couldn't find package libntdb-devel>=0.9
	hsh-install: Failed to calculate package file list.

sbcl-1.4.12-alt1
	23	0   0.0   1601 100.0   1601 100.0	 -  (FLET SB-UNIX::BODY :IN
	SAVE-LISP-AND-DIE)
	24	0   0.0   1601 100.0   1601 100.0	 -  (FLET "WITHOUT-INTERRUPTS-BODY-27"
	:IN SAVE-LISP-AND-DIE)
	25	0   0.0   1601 100.0   1601 100.0	 -  (LABELS SB-IMPL::RESTART-LISP :IN
	SAVE-LISP-AND-DIE)
	26	0   0.0     96	 6.0   1601 100.0	 -  "foreign function
	interrupt_handle_pending"
	27	0   0.0     96	 6.0   1601 100.0	 -  "foreign function handle_trap"
	0   0.0					    elsewhere
	* make: Leaving directory '/usr/src/RPM/BUILD/sbcl-1.4.12/sbcl-1.4.12/contrib/sb-sprof'
	WARNING! Some of the contrib modules did not build successfully or pass
	their self-tests. Failed contribs:"
	sb-concurrency

sgc-0.2.1-alt1
	pygame.display.init()
	error: Couldn't open X11 display
	The full traceback has been saved in /usr/src/tmp/sphinx-err-4KL65G.log, if you want
	to report the issue to the developers.

transgui-5.15.4-alt1.S1
	$0000000000585713
	$0000000000605C1C
	$0000000000404218
	$,29) Подсказка: (5024) Паpаметp "Sender" не использyется
	(1008) 1885 строк скомпилиpовано, 0.6 сек.
	(1022) 4 подсказок
	0000000000403B46
	$0000000000401D15
	$0000000000407705
	$000000000040A39F

xplayer-1.8.3-alt1
	void	 g_type_class_add_private	(gpointer		     g_class,
	bacon-video-widget.c:980:91: error: 'BVW_TYPE_AUDIO_OUTPUT_TYPE' undeclared (first use
	in this function); did you mean 'PROP_AUDIO_OUTPUT_TYPE'?
	"The type of audio output to use.", BVW_TYPE_AUDIO_OUTPUT_TYPE,
	--
	bacon-video-widget.c: In function 'bacon_video_widget_init':
	bacon-video-widget.c:1153:21: error: 'BVW_TYPE_METADATA_TYPE' undeclared (first use in
	this function); did you mean 'GST_TYPE_MESSAGE_TYPE'?
	g_type_class_ref (BVW_TYPE_METADATA_TYPE);
	GST_TYPE_MESSAGE_TYPE
	bacon-video-widget.c:1154:21: error: 'BVW_TYPE_DVD_EVENT' undeclared (first use in this
	function); did you mean 'GST_TYPE_EVENT'?
	g_type_class_ref (BVW_TYPE_DVD_EVENT);
	GST_TYPE_EVENT
	bacon-video-widget.c:1155:21: error: 'BVW_TYPE_ROTATION' undeclared (first use in this
	function); did you mean 'ATK_TYPE_RELATION'?
	g_type_class_ref (BVW_TYPE_ROTATION);
	--
	bacon-video-widget.c: In function 'bacon_video_widget_finalize':
	bacon-video-widget.c:2568:42: error: 'BVW_TYPE_METADATA_TYPE' undeclared (first use in
	this function); did you mean 'GST_TYPE_MESSAGE_TYPE'?
	g_type_class_unref (g_type_class_peek (BVW_TYPE_METADATA_TYPE));
	GST_TYPE_MESSAGE_TYPE
	bacon-video-widget.c:2569:42: error: 'BVW_TYPE_DVD_EVENT' undeclared (first use in this
	function); did you mean 'GST_TYPE_EVENT'?
	g_type_class_unref (g_type_class_peek (BVW_TYPE_DVD_EVENT));
	GST_TYPE_EVENT
	bacon-video-widget.c:2570:42: error: 'BVW_TYPE_ROTATION' undeclared (first use in this
	function); did you mean 'ATK_TYPE_RELATION'?
	g_type_class_unref (g_type_class_peek (BVW_TYPE_ROTATION));
	--
	bacon-video-widget.c: In function 'bacon_video_widget_dvd_event':
	bacon-video-widget.c:3875:51: error: 'BVW_TYPE_DVD_EVENT' undeclared (first use in this
	function); did you mean 'GST_TYPE_EVENT'?
	GST_DEBUG ("Sending event '%s'", get_type_name (BVW_TYPE_DVD_EVENT, type));
	--
	bacon-video-widget.c: In function 'bacon_video_widget_set_rotation':
	bacon-video-widget.c:4501:22: error: 'BVW_TYPE_ROTATION' undeclared (first use in this
	function); did you mean 'ATK_TYPE_RELATION'?
	get_type_name (BVW_TYPE_ROTATION, rotation),
	--
	bacon-video-widget.c: In function 'bacon_video_widget_get_metadata_string':
	bacon-video-widget.c:5129:44: error: 'BVW_TYPE_METADATA_TYPE' undeclared (first use in
	this function); did you mean 'GST_TYPE_MESSAGE_TYPE'?
	GST_DEBUG ("%s = '%s'", get_type_name (BVW_TYPE_METADATA_TYPE, type), string);

	12 error logs REMOVED from the list
elixir-1.5.2-alt1
gromacs-4.0.7-alt8
libntdb-1.0-alt1
libsecret-0.18.6-alt1
libwebkitgtk2-2.4.11-alt5
perl-Net-Ping-2.70-alt1
psi-plus-1.2.109-alt1
python-module-sh-1.12.14-alt2
qemu-3.0.0-alt2
xfce4-notes-plugin-1.8.1-alt2
xfce4-vala-4.10.0-alt9
xfsprogs-4.14.0-alt1

Total 459 error logs.


Sisyphus-cybertalk