[cyber] I: Sisyphus-20181123 x86_64 beehive_status: +14 -11 (442)

ALT beekeeper hiver altlinux.org
23 09:31:59 MSK 2018


	14 NEW error logs

cilk-5.4.6-alt11
	perl -I. ./bfnnconv.pl ./cilk-faq.bfnn
	no ./cilk-faq.xrefdb (No such file or directory) at ./bfnnconv.pl line 43.
	S0	    
S1		 
Q1.1		
Q1.2	       
Q1.3	      
Q1.4	     
Q1.5
	
Q1.6	       
Q1.7	      
Q1.8	     
S2	  
Q2.1		 
Q2.2
	
Q2.3	       
Q2.4	      
S3	   
Q3.1	  
Q3.2		 
Q3.3
	
Q3.4	       
unknown question `compile' at ./bfnnconv.pl line 221, <> line 263.
	--
	libtool: install: /bin/install -p .libs/libcilk.g.so.0.0.0
	/usr/src/tmp/cilk-buildroot/usr/lib64/libcilk.g.so.0.0.0
	/bin/install: cannot stat '.libs/libcilk.g.so.0.0.0': No such file or directory
	make[2]: *** [Makefile:522: install-libLTLIBRARIES] Error 1

gromacs-4.0.7-alt8
	../../../include/vec.h:760:13: warning: 'calc_lll' defined but not used [-Wunused-function]
	static void calc_lll(rvec box,rvec lll)
	In file included from ../../../include/vec.h:121,
	from ../../../src/tools/addconf.c:42:
	../../../include/maths.h:126:1: warning: 'gmx_numzero' defined but not used
	[-Wunused-function]
	gmx_numzero(double a)
	make[3]: Leaving directory '/usr/src/RPM/BUILD/gromacs-4.0.7/double/src/tools'
	make[2]: *** [Makefile:377: all-recursive] Error 1
	make[1]: *** [Makefile:315: all] Error 2
	make: *** [Makefile:406: all-recursive] Error 1

libappindicator-12.10.0-alt8.1
	CC	 libappindicator3_la-app-indicator.lo
	../../src/app-indicator.c:43:10: fatal error: application-service-marshal.h: No such
	file or directory
	#include "application-service-marshal.h"

libotr5-4.1.1-alt1.1
	regression/random-msg-disconnect-auth.sh ....... ok
	hasher-priv: master: idle time limit (3600 seconds) exceeded

mailutils-3.5-alt1
	rpm-build-licenses is already the newest version.
	E: Couldn't find package emacs-git
	hsh-install: Failed to calculate package file list.

neko-2.2.0-alt1
	make[1]: *** Waiting for unfinished jobs....
	make[2]: Entering directory '/usr/src/RPM/BUILD/neko-2.2.0'
	[ 87%] Generating bin/nekoml.std
	GC Warning: pthread_getattr_np or pthread_attr_getstack failed for main thread
	GC Warning: Couldn't read /proc/stat
	make[2]: Leaving directory '/usr/src/RPM/BUILD/neko-2.2.0'
	make[1]: Entering directory '/usr/src/RPM/BUILD/neko-2.2.0'
	[ 96%] Built target nekoml.std
	make[1]: Leaving directory '/usr/src/RPM/BUILD/neko-2.2.0'
	make: *** [Makefile:163: all] Error 2

perl-Git-Repository-1.322-alt1
	t/23-quiet.t ............... ok
	#   Failed test '... expected warning'
	#   at t/24-errors.t line 216.
	--
	#     doesn't match '(?^:^error: pathspec 'does-not-exist' did not match any file\(s\)
	known to git\.)'
	#   Failed test 'checkout does-not-exist: died'
	#   at t/24-errors.t line 209.
	--
	#     doesn't match '(?^:^error: pathspec 'does-not-exist' did not match any file\(s\)
	known to git\.)'
	#   Failed test 'checkout does-not-exist: died'
	#   at t/24-errors.t line 209.
	--
	t/24-errors.t		 (Wstat: 768 Tests: 65 Failed: 3)
	Failed tests:  19, 26, 29
	Non-zero exit status: 3
	--
	Result: FAIL
	Failed 1/21 test programs. 3/573 subtests failed.
	make: *** [Makefile:780: test_dynamic] Error 255

python-module-sh-1.12.14-alt2
	test_piped_exception1 (__main__.FunctionalTests) ... ok
	test_piped_exception2 (__main__.FunctionalTests) ... ERROR
	test_piped_generator (__main__.FunctionalTests) ... ok
	--
	test_unbuffered (__main__.StreamBuffererTests) ... ok
	ERROR: test_piped_exception2 (__main__.FunctionalTests)
	Traceback (most recent call last):
	--
	Exception ignored in: <_io.TextIOWrapper name='<stdout>' mode='w' encoding='UTF-8'>
	BrokenPipeError: [Errno 32] Broken pipe
	Ran 156 tests in 74.758s
	FAILED (errors=1, skipped=2)
	Coverage.py warning: Module sh.py was never imported. (module-not-imported)

python-module-zdaemon-4.2.0-alt1
	testDirectoryChown (zdaemon.tests.testzdrun.TestRunnerDirectory) ... ok
	FAIL: test_start_test_program (zdaemon.tests.tests)
	Doctest: zdaemon.tests.tests.test_start_test_program
	--
	raise self.failureException(self.format_failure(new.getvalue()))
	AssertionError: Failed doctest test for zdaemon.tests.tests.test_start_test_program
	File "/usr/src/RPM/BUILD/python-module-zdaemon-4.2.0/src/zdaemon/tests/tests.py",
	line 267, in test_start_test_program
	--
	os.remove('x')
	OSError: [Errno 2] No such file or directory: 'x'
	Ran 81 tests in 83.348s
	FAILED (failures=1)
	Test failed: <unittest.runner.TextTestResult run=81 errors=0 failures=1>
	error: Test failed: <unittest.runner.TextTestResult run=81 errors=0 failures=1>

sbcl-1.4.12-alt1
	25	0   0.0    180	10.6   1694 100.0	 -  "foreign function
	interrupt_handle_pending"
	26	0   0.0    180	10.6   1694 100.0	 -  "foreign function handle_trap"
	27	0   0.0      1	 0.1   1694 100.0	 -  (FLET SB-UNIX::BODY :IN
	SB-KERNEL::POST-GC)
	28	0   0.0      1	 0.1   1694 100.0	 -  "foreign function call_into_lisp"
	29	0   0.0      1	 0.1   1694 100.0	 -  "foreign function maybe_gc"
	0   0.0					    elsewhere
	* make: Leaving directory '/usr/src/RPM/BUILD/sbcl-1.4.12/sbcl-1.4.12/contrib/sb-sprof'
	WARNING! Some of the contrib modules did not build successfully or pass
	their self-tests. Failed contribs:"
	sb-concurrency

sdcv-0.5.2-alt1
	10/10 Test  #7: t_interactive ....................   Passed    5.01 sec
	90% tests passed, 1 tests failed out of 10
	Total Test time (real) =   5.02 sec
	The following tests FAILED:
	10 - t_datadir (Failed)

sgc-0.2.1-alt1
	pygame.display.init()
	error: Couldn't open X11 display
	The full traceback has been saved in /usr/src/tmp/sphinx-err-59FD9J.log, if you want
	to report the issue to the developers.

transgui-5.15.4-alt1.S1
	(1002) Целевая ОС: Linux for x86-64
	(3104) Компиляция trcomp.pas
	(3104) Компиляция vargrid.pas
	(3104) Компиляция varlist.pas
	/usr/src/RPM/BUILD/transgui-5.15.4/vargrid.pas(93,28) Подсказка: (5024)
	Паpаметp "Sender" не использyется
	/usr/src/RPM/BUILD/transgui-5.15.4/vargrid.pas(107An unhandled exception occurred at
	$0000000000000000:
	EAccessViolation: Access violation
	$0000000000000000
	$0000000000579F37
	$000000000057B141

volpack-1.0c7-alt1.1.qa1
	/usr/bin/m4 -DSourceFile=vp_warpA331R.c no_edit_header vp_warpA.m4 > vp_warpA331R.c
	chmod: cannot access 'vp_warpA331R.c': No such file or directory
	make[2]: *** [Makefile:659: vp_warpA110N.c] Error 1

	11 error logs REMOVED from the list
archivemail-0.9.0-alt1
automake_1.11-1.11.6-alt8
bitlbee-facebook-1.1.2-alt1.g553593d
flac-1.3.2-alt1
holotz-castle-1.3.14-alt2.qa1
ipfm-0.11.5-alt1.qa1
kernel-modules-ipt-so-std-def-1.0-alt2.265808.1
libzrtp-1.0.6-alt1
python-module-pexpect-4.6-alt1
spl-0.7.12-alt1
trackballs-1.1.4-alt1.qa1

Total 442 error logs.


Sisyphus-cybertalk