[cyber] I: Sisyphus-20181107 x86_64 beehive_status: +12 -9 (354)

ALT beekeeper hiver altlinux.org
7 09:09:13 MSK 2018


	12 NEW error logs

SNNS-4.3-alt1.1.1.1
	kr_err = krui_saveNet(tmp_file1, netname);
	ic_snns.c: In function 'setSeed':
	ic_snns.c:2206:3: warning: 'seed' may be used uninitialized in this function
	[-Wmaybe-uninitialized]
	krui_setSeedNo(seed);
	make[1]: Leaving directory '/usr/src/RPM/BUILD/SNNSv4.3/tools/sources'
	make[1]: Entering directory '/usr/src/RPM/BUILD/SNNSv4.3/tools/sources'
	x86_64-alt-linux-gcc   batchman.o gram1.tab.o lex.yyz.o icopjmp.o ictab.o symtab.o
	backpatch.o memory.o ic_snns.o error.o arglist.o snns_intfce.o special_jacket.o lex.yyy.o
	../../kernel/sources/libkernel.a ../../kernel/sources/libfunc.a -lm -lfl  -o batchman
	ic_snns.o: In function `pruneNet':
	/usr/src/RPM/BUILD/SNNSv4.3/tools/sources/ic_snns.c:1770: warning: the use of `tempnam'
	is dangerous, better use `mkstemp'
	make[1]: Leaving directory '/usr/src/RPM/BUILD/SNNSv4.3/tools/sources'

golang-github-xiang90-probing-0-alt1_0.6.git07dd2e8
	+ go test -compiler gc github.com/xiang90/probing
	--- FAIL: TestProbe (0.10s)
	prober_test.go:26: total = 31, want around 100
	--- FAIL: TestProbeReset (0.10s)
	prober_test.go:61: total = 32, want around 100

gromacs-4.0.7-alt8
	../../../include/vec.h:760:13: warning: 'calc_lll' defined but not used [-Wunused-function]
	static void calc_lll(rvec box,rvec lll)
	In file included from ../../../include/vec.h:121:0,
	from ../../../src/tools/addconf.c:42:
	../../../include/maths.h:126:1: warning: 'gmx_numzero' defined but not used
	[-Wunused-function]
	gmx_numzero(double a)
	make[3]: Leaving directory '/usr/src/RPM/BUILD/gromacs-4.0.7/mpi-single/src/tools'
	make[2]: *** [Makefile:377: all-recursive] Error 1
	make[1]: *** [Makefile:315: all] Error 2
	make: *** [Makefile:406: all-recursive] Error 1

holotz-castle-1.3.14-alt2.qa1
	a - JLib/Util/JTextUtil.o
	a - JLib/Util/JTimer.o
	a - JLib/Util/JUtil.o
	a - JLib/Util/JApp.o
	a - JLib/Util/JFS.o
	a - JLib/Util/JThread.o
	a - JLib/Util/JRW.o
	a - JLib/Math/J2DPolygon.o
	make[2]: Leaving directory '/usr/src/RPM/BUILD/holotz-castle-1.3.14-src/JLib'
	make: *** [Makefile:7: all] Error 2

kernel-modules-ipt-so-std-def-1.0-alt2.265807.1
	[    0.1520
	hasher-priv: master: idle time limit (3600 seconds) exceeded

perl-IO-Event-0.813-alt2
	Result: FAIL
	Failed 1/12 test programs. 0/920 subtests failed.
	make: *** [Makefile:780: test_dynamic] Error 255

python-module-zdaemon-4.2.0-alt1
	testDirectoryChown (zdaemon.tests.testzdrun.TestRunnerDirectory) ... ok
	FAIL: test_start_test_program (zdaemon.tests.tests)
	Doctest: zdaemon.tests.tests.test_start_test_program
	--
	raise self.failureException(self.format_failure(new.getvalue()))
	AssertionError: Failed doctest test for zdaemon.tests.tests.test_start_test_program
	File "/usr/src/RPM/BUILD/python-module-zdaemon-4.2.0/src/zdaemon/tests/tests.py",
	line 267, in test_start_test_program
	--
	os.remove('x')
	OSError: [Errno 2] No such file or directory: 'x'
	Ran 81 tests in 84.082s
	FAILED (failures=1)
	Test failed: <unittest.runner.TextTestResult run=81 errors=0 failures=1>
	error: Test failed: <unittest.runner.TextTestResult run=81 errors=0 failures=1>

python3-3.6.5-alt1.1
	1 test failed:
	test_signal
	20 tests skipped:
	test_curses test_devpoll test_kqueue test_msilib test_nis
	test_ossaudiodev test_smtpnet test_socketserver test_startfile
	test_timeout test_tix test_tk test_ttk_guionly test_urllib2net
	test_urllibnet test_winconsoleio test_winreg test_winsound
	test_xmlrpc_net test_zipfile64
	Total duration: 6 min 37 sec
	Tests result: FAILURE

quilt-0.65.0.27.0f2a-alt1
	make: Leaving directory '/usr/src/RPM/BUILD/quilt-0.65.0.27.0f2a-alt1'
	make: Entering directory '/usr/src/RPM/BUILD/quilt-0.65.0.27.0f2a-alt1'
	[three.test]
	66 commands (66 passed, 0 failed)
	make: Leaving directory '/usr/src/RPM/BUILD/quilt-0.65.0.27.0f2a-alt1'
	make: Entering directory '/usr/src/RPM/BUILD/quilt-0.65.0.27.0f2a-alt1'
	[two.test]
	57 commands (57 passed, 0 failed)
	make: Leaving directory '/usr/src/RPM/BUILD/quilt-0.65.0.27.0f2a-alt1'
	make: Target 'check' not remade because of errors.

sbcl-1.4.12-alt1
	21	0   0.0   1973 100.0   1973 100.0	 -  (FLET SB-UNIX::BODY :IN
	SAVE-LISP-AND-DIE)
	22	0   0.0   1973 100.0   1973 100.0	 -  (FLET "WITHOUT-INTERRUPTS-BODY-27"
	:IN SAVE-LISP-AND-DIE)
	23	0   0.0   1973 100.0   1973 100.0	 -  (LABELS SB-IMPL::RESTART-LISP :IN
	SAVE-LISP-AND-DIE)
	24	0   0.0    212	10.7   1973 100.0	 -  "foreign function
	interrupt_handle_pending"
	25	0   0.0    212	10.7   1973 100.0	 -  "foreign function handle_trap"
	0   0.0					    elsewhere
	* make: Leaving directory '/usr/src/RPM/BUILD/sbcl-1.4.12/sbcl-1.4.12/contrib/sb-sprof'
	WARNING! Some of the contrib modules did not build successfully or pass
	their self-tests. Failed contribs:"
	sb-concurrency

sgc-0.2.1-alt1
	pygame.display.init()
	error: Couldn't open X11 display
	The full traceback has been saved in /usr/src/tmp/sphinx-err-PXZY74.log, if you want
	to report the issue to the developers.

transgui-5.15.4-alt1.S1
	(3104) Компиляция trcomp.pas
	(3104) Компиляция vargrid.pas
	(3104) Компиляция varlist.pas
	/usr/src/RPM/BUILD/transgui-5.15.4/vargrid.pas(93,28) Подсказка: (5024)
	Паpаметp "Sender" не использyется
	/usr/src/RPM/BUILD/transgui-5.15.4/vargrid.pas(107An unhandled exception occurred at
	$000000000053DF03:
	EAccessViolation: Access violation
	$000000000053DF03
	$0000000000575E75
	$0000000000579F37
	$000000000057B141

	9 error logs REMOVED from the list
archivemail-0.9.0-alt1
automake_1.11-1.11.6-alt8
ipfm-0.11.5-alt1.qa1
openssh-7.2p2-alt3
perl-Time-Format_XS-1.03-alt3.1.1.1.1
python-module-joblib-0.11-alt2
racket-6.10.1-alt1
spl-0.7.11-alt1
zopfli-1.0.2-alt2

Total 354 error logs.


Sisyphus-cybertalk