[cyber] I: p8-20180624 i586 beehive_status: +7 -17 (979)

ALT beekeeper hiver altlinux.org
24 19:16:00 MSK 2018


	7 NEW error logs

gromacs-4.0.7-alt8
	In file included from ../../../src/tools/calcpot.c:46:0:
	../../../include/force.h:51:14: warning: 'sepdvdlformat' defined but not used
	[-Wunused-variable]
	static char *sepdvdlformat="  %-30s V %12.5e  dVdl %12.5e\n";
	make[3]: Leaving directory `/usr/src/RPM/BUILD/gromacs-4.0.7/mpi-double/src/tools'
	make[2]: *** [all-recursive] Error 1
	make[2]: Leaving directory `/usr/src/RPM/BUILD/gromacs-4.0.7/mpi-double/src'
	make[1]: *** [all] Error 2
	make[1]: Leaving directory `/usr/src/RPM/BUILD/gromacs-4.0.7/mpi-double/src'
	make: *** [all-recursive] Error 1
	make: Leaving directory `/usr/src/RPM/BUILD/gromacs-4.0.7/mpi-double'

opendx-4.4.4-alt5
	cat dx.mdf |sed '/^#/d' > tmp.mdf
	cat tmp.mdf |sed -f stripl.sed > dx.mdf
	rm -f tmp.c
	make[3]: Leaving directory `/usr/src/RPM/BUILD/opendx-4.4.4/src/exec/dxmods'
	make[2]: *** [all-recursive] Error 1
	make[2]: Leaving directory `/usr/src/RPM/BUILD/opendx-4.4.4/src/exec'
	make[1]: *** [all-recursive] Error 1
	make[1]: Leaving directory `/usr/src/RPM/BUILD/opendx-4.4.4/src'
	make: *** [all-recursive] Error 1
	make: Leaving directory `/usr/src/RPM/BUILD/opendx-4.4.4'

perl-HTML-Widget-1.11-alt2
	t/06bugs_select_empty_options.t .......... ok
	#   Failed test 'constraint value'
	#   at t/06bugs_select_zero_key_constraint.t line 23.
	--
	#     expected: '1'
	#   Failed test 'constraint value'
	#   at t/06bugs_select_zero_key_constraint.t line 25.
	--
	t/06bugs_select_zero_key_constraint.t  (Wstat: 512 Tests: 3 Failed: 2)
	Failed tests:  2-3
	Non-zero exit status: 2
	--
	Result: FAIL
	Failed 1/90 test programs. 2/625 subtests failed.
	make: *** [test_dynamic] Error 255

swi-prolog-5.6.15-alt1.qa2
	checking "linux gettid"... no
	checking "linux 2.6 /proc"... cat: /proc/61391/task/61391/stat: No such file or directory
	no
	--
	rc.o: In function `rcextract':
	/usr/src/RPM/BUILD/pl-5.6.15/src/rc/rc.c:144: undefined reference to `rc_open_archive'
	/usr/src/RPM/BUILD/pl-5.6.15/src/rc/rc.c:153: undefined reference to `rc_open'
	/usr/src/RPM/BUILD/pl-5.6.15/src/rc/rc.c:158: undefined reference to `rc_read'
	/usr/src/RPM/BUILD/pl-5.6.15/src/rc/rc.c:179: undefined reference to `rc_close'
	/usr/src/RPM/BUILD/pl-5.6.15/src/rc/rc.c:185: undefined reference to `rc_close_archive'
	rc.o: In function `rcls':
	/usr/src/RPM/BUILD/pl-5.6.15/src/rc/rc.c:116: undefined reference to `rc_open_archive'
	/usr/src/RPM/BUILD/pl-5.6.15/src/rc/rc.c:134: undefined reference to `rc_close_archive'
	rc.o: In function `rcadd':
	/usr/src/RPM/BUILD/pl-5.6.15/src/rc/rc.c:195: undefined reference to `rc_open_archive'
	/usr/src/RPM/BUILD/pl-5.6.15/src/rc/rc.c:219: undefined reference to `rc_append_file'

tardy-1.17-alt2.qa1
	mv: awk -f etc/txt2c.awk man1/z_exit.so > man1/z_exit.h
	cannot stat 'normal.o': No such file or directory
	make: *** [common/file/input/normal.o] Error 1

texlive-bin-2008.0-alt0.15.6
	sh ./base/MKlib_gen.sh "i586-alt-linux-gcc -E -DHAVE_CONFIG_H -I../ncurses
	-I. -I. -I../include  -D_GNU_SOURCE -DNDEBUG" "gawk" implemented <../include/curses.h
	>link_test.c
	cat: namehdr: No such file or directory
	cat: boolcodes: No such file or directory
	cat: numcodes: No such file or directory
	cat: strcodes: No such file or directory
	cat: codeftr: No such file or directory
	make[2]: *** [names.c] Error 1

transgui-5.15.4-alt0.M80P.1
	(3104) Компиляция vargrid.pas
	(3104) Компиляция varlist.pas
	/usr/src/RPM/BUILD/transgui-5.15.4/vargrid.pas(93,28) Подсказка: (5024)
	Паpаметp "Sender" не использyется
	/usr/src/RPM/BUILD/transgui-5.15.4/vargrid.pas(107,29) Подсказка: (5024)
	Паpаметp "Sender" нAn unhandled exception occurred at $0813DCA3:
	EAccessViolation: Access violation
	$0813DCA3
	$0816A007
	$0816D1F7
	$0816E0DD
	$080603B2

	17 error logs REMOVED from the list
LibreOffice-5.4.7.2-alt0.M80P.1
e-uae-0.8.29-alt1
halibut-1.0-alt1.qa1
holotz-castle-1.3.14-alt2.qa1
intercal-0.29-alt1.git20140828.1
jed-2:0.99.19-alt2.qa2.1
kf5-kconfig-5.46.0-alt1.M80P.1
libosinfo-0.2.12-alt1
mdbtools-0.7.1-alt1
octave-instrument-control-0.2.2-alt1
perl-BerkeleyDB-0.55-alt1.1
perl-Gnome2-Canvas-1.002-alt5.1.1
perl-HTML-FormFu-MultiForm-1.00-alt1
perl-HTML-WikiConverter-MoinMoin-0.54-alt1.1
python-module-netcall-0.4.2-alt2.git20141120
scotty-2:3.0.0-alt5.qa1
tuxvsclippy-0.2.5-alt3.1.qa1

Total 979 error logs.


Sisyphus-cybertalk