[cyber] I: Sisyphus-20180623 x86_64 beehive_status: +17 -28 (443)

ALT beekeeper hiver altlinux.org
23 06:02:37 MSK 2018


	17 NEW error logs

altlinux-freedesktop-menu-0.65-alt3
	+ j=altlinux-webdevelopment.directory
	+ grep altlinux-webdevelopment.directory ignore.list
	+ grep 'Name\[ru\]=' desktop-directories/altlinux-webdevelopment.directory
	+ for i in 'desktop-directories/*.directory'
	++ basename desktop-directories/altlinux-xfce.directory
	+ j=altlinux-xfce.directory
	+ grep altlinux-xfce.directory ignore.list
	+ rm ignore.list
	+ '[' 0 -gt 0 ']'
	+ exit 1

emacs-mode-tdtd-0.71-alt7
	In toplevel form:
	tdtd-font-maker.el:871:1:Error: Invalid read syntax: "Expected opening brace after \\N"
	In dtd-comment:

fortranposix-0.1.1-alt1
	f95 -pipe -Wall -g -O2 -fPIC -DPIC -shared fortranposix.f90 -o libfortranposix.so
	posixwrapper.o
	x86_64-alt-linux-gfortran: error: posixwrapper.o: No such file or directory
	make: *** [Makefile:49: libfortranposix.so] Error 1

gimp-2.10.2-alt1
	CC	 gimp.o
	gimp.c:67:10: fatal error: gimpmarshal.h: No such file or directory
	#include "gimpmarshal.h"

golang-github-xtaci-smux-1.0.7-alt1_1
	+ go test -compiler gc github.com/xtaci/smux
	--- FAIL: TestReadDeadline (0.00s)
	session_test.go:554: No error when reading with past deadline

gromacs-4.0.7-alt8
	../../../include/vec.h:760:13: warning: 'calc_lll' defined but not used [-Wunused-function]
	static void calc_lll(rvec box,rvec lll)
	In file included from ../../../include/vec.h:121:0,
	from ../../../src/tools/addconf.c:42:
	../../../include/maths.h:126:1: warning: 'gmx_numzero' defined but not used
	[-Wunused-function]
	gmx_numzero(double a)
	make[3]: Leaving directory '/usr/src/RPM/BUILD/gromacs-4.0.7/mpi-single/src/tools'
	make[2]: *** [Makefile:377: all-recursive] Error 1
	make[1]: *** [Makefile:315: all] Error 2
	make: *** [Makefile:406: all-recursive] Error 1

holotz-castle-1.3.14-alt2.qa1
	mv HC ../holotz-castle
	/usr/bin/ld: cannot find -lJLib
	collect2: error: ld returned 1 exit status
	mv: cannot stat 'HC': No such file or directory
	make[1]: *** [Makefile:57: HC] Error 1

ipfm-0.11.5-alt1.qa1
	gcc -pipe -frecord-gcc-switches -Wall -g -O2
	-Wall	-DDEFAULT_OPTIONS_PIDFILE=\"/var/run/ipfm.pid\"
	-DDEFAULT_OPTIONS_CONFIGFILE=\"/etc/ipfm.conf\"
	-DDEFAULT_OPTIONS_LOGFILE=\"/var/log/ipfm/%d-%b.%H-%M\"   -c lex.yy.c
	config.l:44:10: fatal error: y.tab.h: No such file or directory
	#include "y.tab.h"

keepass-2.39.1-alt1.S1
	used by your application.
	Task "GenerateResource" execution -- FAILED
	Done building target "GenerateResources" in project
	"/usr/src/RPM/BUILD/keepass-2.39.1/KeePass/KeePass.csproj".-- FAILED
	Done building project "/usr/src/RPM/BUILD/keepass-2.39.1/KeePass/KeePass.csproj".-- FAILED
	Task "MSBuild" execution -- FAILED
	Done building target "KeePass" in project
	"/usr/src/RPM/BUILD/keepass-2.39.1/KeePass.sln".-- FAILED
	Done building project "/usr/src/RPM/BUILD/keepass-2.39.1/KeePass.sln".-- FAILED
	Build FAILED.
	Errors:

make-2:4.2.1-alt2
	Caught signal 14!
	FAILED (13/15 passed)
	features/override ....................................... ok	 (4 passed)

mono-5.10.0.157-alt4.S1
	Native stacktrace:
	hasher-priv: master: idle time limit (3600 seconds) exceeded

perl-Crypt-OpenPGP-1.12-alt1
	# DSA
	#   Failed test 'public key_id matches secret key_id'
	#   at t/13-keygen.t line 29.
	--
	#     expected: '~|tF`'
	#   Failed test 'serialized public key_id matches secret key_id'
	#   at t/13-keygen.t line 50.
	--
	t/13-keygen.t  (Wstat: 512 Tests: 29 Failed: 2)
	Failed tests:  19, 28
	Non-zero exit status: 2
	--
	Result: FAIL
	Failed 1/15 test programs. 2/340 subtests failed.
	make: *** [Makefile:830: test_dynamic] Error 255

python-module-terminado-0.5-alt1.git20150717.2.1
	test_single_process (terminado.tests.basic_test.SingleTermTests) ... ok
	test_max_terminals (terminado.tests.basic_test.UniqueTermTests) ... ERROR
	test_unique_processes (terminado.tests.basic_test.UniqueTermTests) ... ok
	ERROR: test_max_terminals (terminado.tests.basic_test.UniqueTermTests)
	Traceback (most recent call last):
	--
	self.assertEquals(msg[0], 'setup')
	TypeError: 'NoneType' object has no attribute '__getitem__'
	-------------------- >> begin captured logging << --------------------
	--
	terminado.websocket: INFO: TermSocket.open: None
	tornado.application: ERROR: Uncaught exception in /unique
	Traceback (most recent call last):
	--
	terminado.websocket: INFO: TermSocket.open: None
	tornado.application: ERROR: Uncaught exception in /unique
	Traceback (most recent call last):
	--
	Ran 8 tests in 34.859s
	FAILED (errors=1)

ruby-crass-1.0.4-alt1
	/usr/lib/ruby/mutex_m.rb:71:in `mu_synchronize'
	/usr/lib/ruby/gems/2.5.0/gems/minitest-5.10.3/lib/minitest/parallel.rb:34:in `block
	(2 levels) in start'
	from /usr/lib/ruby/gems/2.5.0/gems/minitest-5.10.3/lib/minitest/parallel.rb:52:in `each'
	from /usr/lib/ruby/gems/2.5.0/gems/minitest-5.10.3/lib/minitest/parallel.rb:52:in
	`shutdown'
	from /usr/lib/ruby/gems/2.5.0/gems/minitest-5.10.3/lib/minitest.rb:140:in `run'
	from /usr/lib/ruby/gems/2.5.0/gems/minitest-5.10.3/lib/minitest.rb:63:in `block in autorun'
	rake aborted!
	Command failed with status (1): [ruby -w -I"lib:test:test"
	-I"/usr/lib/ruby/gems/2.5.0/gems/rake-12.3.0/lib"
	"/usr/lib/ruby/gems/2.5.0/gems/rake-12.3.0/lib/rake/rake_test_loader.rb"
	"test/test_crass.rb" "test/test_css_parsing_tests.rb" "test/test_parse_properties.rb"
	"test/test_parse_rules.rb" "test/test_parse_stylesheet.rb" "test/test_serialization.rb" ]
	Tasks: TOP => test
	(See full trace by running task with --trace)

sgc-0.2.1-alt1
	pygame.display.init()
	error: Couldn't open X11 display
	The full traceback has been saved in /usr/src/tmp/sphinx-err-C7lSj7.log, if you want
	to report the issue to the developers.

transgui-5.15.4-alt1.S1
	(3104) Компиляция trcomp.pas
	(3104) Компиляция vargrid.pas
	(3104) Компиляция varlist.pas
	/usr/src/RPM/BUILD/transgui-5.15.4/vargrid.pas(93,28) Подсказка: (5024)
	Паpаметp "Sender" не использyется
	/usr/src/RPM/BUILD/transgui-5.15.4/vargrid.pas(107An unhandled exception occurred at
	$000000000053DF03:
	EAccessViolation: Access violation
	$000000000053DF03
	$0000000000575E75
	$0000000000579F37
	$000000000057B141

uae-0.8.29-alt2
	make -C tools build68kc
	make[2]: *** No rule to make target 'build68kc'.  Stop.
	make[1]: *** [Makefile:115: tools/build68k] Error 2

	28 error logs REMOVED from the list
arachne-pnr-0.1.0.0.203.g7e135ed-alt1
blobwars-2.00-alt1
couchdb-1.6.1-alt1
ddcal-0.9-alt1
desmume-0.9.11-alt1
libdivecomputer-0.4.2-alt1_8
libgnome-sharp-2.24.2-alt3.S1
libgtk-sharp2-2.12.11-alt5.S1
libigtl-1.9.7-alt1_12
libvorbis-1.3.6-alt1
marsyas-0.6.0-alt1.alpha.git20150301.2
monodevelop-6.3.0.864-alt1.S1
nfdump-1.6.15-alt2
openstack-aodh-4.0.1-alt1
openstack-glance-1:14.0.0-alt3
openstack-heat-1:8.0.3-alt1
openstack-keystone-1:11.0.3-alt1
openstack-neutron-1:10.0.2-alt3
openstack-neutron-fwaas-1:10.0.1-alt1
openstack-neutron-lbaas-1:10.0.1-alt1
openstack-neutron-vpnaas-1:10.0.0-alt1
pdfpc-4.0.6-alt1
python-module-greenhouse-2.2.0-alt2.git20141230.1
rafkill-1.2.3-alt4_20
strigi-0.7.8-alt6
task-2.5.1-alt2
thrift-0.10.0-alt2_11jpp8
wammu-0.44-alt1

Total 443 error logs.


Sisyphus-cybertalk