[cyber] I: Sisyphus-20180616 i586 beehive_status: +13 -16 (481)

ALT beekeeper hiver altlinux.org
16 07:02:05 MSK 2018


	13 NEW error logs

Mayavi-4.4.0-alt1.git20150422
	(sphinx-build:33497): Gtk-WARNING **: 02:54:51.954: gtk_disable_setlocale() must be
	called before gtk_init()
	hasher-priv: master: idle time limit (3600 seconds) exceeded

automake_1.11-1.11.6-alt7
	make[3]: Entering directory '/usr/src/RPM/BUILD/automake-1.11.6-alt7/tests'
	1 of 893 tests failed
	(58 tests were not run)

bcc-0.5.0-alt1.458
	0.	Running pass 'Interprocedural Sparse Conditional Constant Propagation' on module
	'/usr/lib/libLLVMAnalysis.aScalarEvolution.cpp.o14158706'.
	clang-6.0: error: unable to execute command: Aborted
	clang-6.0: error: linker command failed due to signal (use -v to see invocation)
	make[2]: *** [src/cc/CMakeFiles/bcc-shared.dir/build.make:361: src/cc/libbcc.so.0.5.0]
	Error 254

doublecmd-0.8.2-alt2
	/usr/lib/lazarus/components/lazcontrols/lazcontrols.pas(12,39) Подсказка:
	(5023) Модуль "ShortPathEdit" не используется в LazControls
	/usr/lib/lazarus/components/lazcontrols/lazcontrols.pas(12,54) Подсказка:
	(5023) Модуль "LvlGraphCtrl" не используется в LazControls
	/usr/lib/lazarus/components/lazcontrols/lazcontrols.pas(13,3) Подсказка:
	(5023) Модуль "ExtendedTabControls" не используется в LazControls
	(1008) 8571 строк скоAn unhandled exception occurred at $0813DC23:
	EAccessViolation: Access violation
	$0813DC23
	$08169F87
	$0816D177
	$0816E05D
	$08060332

gimp-2.10.2-alt1
	CC	 gimpbrowser.lo
	gimpbrowser.c:32:10: fatal error: gimpwidgetsmarshal.h: No such file or directory
	#include "gimpwidgetsmarshal.h"

gnome-shell-extensions-3.28.1-alt1
	OK:	   18
	FAIL:	    2
	SKIP:	    0
	--
	Full log written to
	/usr/src/RPM/BUILD/gnome-shell-extensions-3.28.1/noarch-alt-linux/meson-logs/testlog.txt
	FAILED: meson-test
	/usr/bin/python3 -u /usr/bin/meson test --no-rebuild --print-errorlogs

golang-github-xiang90-probing-0-alt1_0.6.git07dd2e8
	+ go test -compiler gc github.com/xiang90/probing
	--- FAIL: TestProbe (0.10s)
	prober_test.go:26: total = 24, want around 100
	--- FAIL: TestProbeReset (0.10s)
	prober_test.go:61: total = 34, want around 100

ipfm-0.11.5-alt1.qa1
	gcc -pipe -frecord-gcc-switches -Wall -g -O2 -march=i586 -mtune=generic
	-Wall	-DDEFAULT_OPTIONS_PIDFILE=\"/var/run/ipfm.pid\"
	-DDEFAULT_OPTIONS_CONFIGFILE=\"/etc/ipfm.conf\"
	-DDEFAULT_OPTIONS_LOGFILE=\"/var/log/ipfm/%d-%b.%H-%M\"   -c lex.yy.c
	config.l:44:10: fatal error: y.tab.h: No such file or directory
	#include "y.tab.h"

kernel-modules-dahdi-std-pae-2.11.1-alt1.263304.1
	<13>Jun 16 01:52:22 rpmi: kernel-source-dahdi-2.11.1-alt1 1456982999 installed
	error: Macro %karch not found
	error: line 36: ExclusiveArch: %karch
	Installing kernel-modules-dahdi-std-pae-2.11.1-alt1.263304.1.src.rpm

kernel-modules-nvidia-un-def-390.67-alt1.266254.1
	<13>Jun 16 01:42:13 rpmi: kernel-source-nvidia-340107-340.107-alt157.S1 1528357811
	installed
	error: Macro %karch not found
	error: line 71: ExclusiveArch: %karch
	Installing kernel-modules-nvidia-un-def-390.67-alt1.266254.1.src.rpm

kernel-modules-tp_smapi-std-pae-0.41-alt3.263304.1
	<13>Jun 15 22:58:38 rpmi: kernel-source-tp_smapi-0.41-0.41-alt1 1354693692 installed
	error: Macro %karch not found
	error: line 34: ExclusiveArch: %karch
	Installing kernel-modules-tp_smapi-std-pae-0.41-alt3.263304.1.src.rpm

llvm6.0-6.0.0-alt0.9.rel
	[3001/3061] : && /usr/bin/clang++  -pipe -Wall -g1 -O2 -march=i586 -mtune=generic -fPIC
	-fvisibility-inlines-hidden -Werror=date-time -Werror=unguarded-availability-new
	-std=c++11 -Wall -W -Wno-unused-parameter -Wwrite-strings -Wcast-qual
	-Wmissing-field-initializers -pedantic -Wno-long-long -Wcovered-switch-default
	-Wnon-virtual-dtor -Wdelete-non-virtual-dtor -Wstring-conversion -fcolor-diagnostics
	-ffunction-sections -fdata-sections -flto=thin -fno-common -Woverloaded-virtual
	-Wno-nested-anon-types -O2 -DNDEBUG  -fuse-ld=lld -Wl,--color-diagnostics -flto=thin
	-Wl,--thinlto-cache-dir=/usr/src/RPM/BUILD/llvm-6.0.0/BUILD/lto.cache
	-Wl,-allow-shlib-undefined   -Wl,--export-dynamic
	-Wl,-rpath-link,/usr/src/RPM/BUILD/llvm-6.0.0/BUILD/./lib  -Wl,-O3
	tools/clang/tools/driver/CMakeFiles/clang.dir/driver.cpp.o
	tools/clang/tools/driver/CMakeFiles/clang.dir/cc1_main.cpp.o
	tools/clang/tools/driver/CMakeFiles/clang.dir/cc1as_main.cpp.o	-o bin/clang-6.0  -lpthread
	lib/libclangBasic.a lib/libclangCodeGen.a lib/libclangDriver.a lib/libclangFrontend.a
	lib/libclangFrontendTool.a lib/libclangCodeGen.a lib/libclangRewriteFrontend.a
	lib/libclangARCMigrate.a lib/libclangStaticAnalyzerFrontend.a lib/libclangFrontend.a
	lib/libclangDriver.a lib/libclangParse.a lib/libclangSerialization.a lib/libclangSema.a
	lib/libclangEdit.a lib/libclangStaticAnalyzerCheckers.a lib/libclangStaticAnalyzerCore.a
	lib/libclangAnalysis.a lib/libclangRewrite.a lib/libclangASTMatchers.a lib/libclangAST.a
	lib/libclangLex.a lib/libclangBasic.a lib/libLLVM-6.0.so && :
	FAILED: bin/clang-6.0
	: && /usr/bin/clang++  -pipe -Wall -g1 -O2 -march=i586 -mtune=generic -fPIC
	-fvisibility-inlines-hidden -Werror=date-time -Werror=unguarded-availability-new
	-std=c++11 -Wall -W -Wno-unused-parameter -Wwrite-strings -Wcast-qual
	-Wmissing-field-initializers -pedantic -Wno-long-long -Wcovered-switch-default
	-Wnon-virtual-dtor -Wdelete-non-virtual-dtor -Wstring-conversion -fcolor-diagnostics
	-ffunction-sections -fdata-sections -flto=thin -fno-common -Woverloaded-virtual
	-Wno-nested-anon-types -O2 -DNDEBUG  -fuse-ld=lld -Wl,--color-diagnostics -flto=thin
	-Wl,--thinlto-cache-dir=/usr/src/RPM/BUILD/llvm-6.0.0/BUILD/lto.cache
	-Wl,-allow-shlib-undefined   -Wl,--export-dynamic
	-Wl,-rpath-link,/usr/src/RPM/BUILD/llvm-6.0.0/BUILD/./lib  -Wl,-O3
	tools/clang/tools/driver/CMakeFiles/clang.dir/driver.cpp.o
	tools/clang/tools/driver/CMakeFiles/clang.dir/cc1_main.cpp.o
	tools/clang/tools/driver/CMakeFiles/clang.dir/cc1as_main.cpp.o	-o bin/clang-6.0  -lpthread
	lib/libclangBasic.a lib/libclangCodeGen.a lib/libclangDriver.a lib/libclangFrontend.a
	lib/libclangFrontendTool.a lib/libclangCodeGen.a lib/libclangRewriteFrontend.a
	lib/libclangARCMigrate.a lib/libclangStaticAnalyzerFrontend.a lib/libclangFrontend.a
	lib/libclangDriver.a lib/libclangParse.a lib/libclangSerialization.a lib/libclangSema.a
	lib/libclangEdit.a lib/libclangStaticAnalyzerCheckers.a lib/libclangStaticAnalyzerCore.a
	lib/libclangAnalysis.a lib/libclangRewrite.a lib/libclangASTMatchers.a lib/libclangAST.a
	lib/libclangLex.a lib/libclangBasic.a lib/libLLVM-6.0.so && :
	--
	#1 0x00000000
	clang-6.0: error: unable to execute command: Aborted
	clang-6.0: error: linker command failed due to signal (use -v to see invocation)
	[3002/3061] : && /usr/bin/clang++  -pipe -Wall -g1 -O2 -march=i586 -mtune=generic -fPIC
	-fvisibility-inlines-hidden -Werror=date-time -Werror=unguarded-availability-new
	-std=c++11 -Wall -W -Wno-unused-parameter -Wwrite-strings -Wcast-qual
	-Wmissing-field-initializers -pedantic -Wno-long-long -Wcovered-switch-default
	-Wnon-virtual-dtor -Wdelete-non-virtual-dtor -Wstring-conversion -fcolor-diagnostics
	-ffunction-sections -fdata-sections -flto=thin -fno-common -Woverloaded-virtual
	-Wno-nested-anon-types -O2 -DNDEBUG  -fuse-ld=lld -Wl,--color-diagnostics -flto=thin
	-Wl,--thinlto-cache-dir=/usr/src/RPM/BUILD/llvm-6.0.0/BUILD/lto.cache
	-Wl,-allow-shlib-undefined
	-Wl,-rpath-link,/usr/src/RPM/BUILD/llvm-6.0.0/BUILD/./lib  -Wl,-O3 -Wl,--gc-sections
	tools/clang/tools/arcmt-test/CMakeFiles/arcmt-test.dir/arcmt-test.cpp.o  -o bin/arcmt-test
	-lpthread lib/libclangARCMigrate.a lib/libclangBasic.a lib/libclangFrontend.a
	lib/libclangLex.a lib/libclangDriver.a lib/libclangParse.a lib/libclangSerialization.a
	lib/libclangSema.a lib/libclangEdit.a lib/libclangStaticAnalyzerCheckers.a
	lib/libclangStaticAnalyzerCore.a lib/libclangAnalysis.a lib/libclangRewrite.a
	lib/libclangASTMatchers.a lib/libclangAST.a lib/libclangLex.a lib/libclangBasic.a
	lib/libLLVM-6.0.so && :

ruby-amazon-ec2-0.9.17-alt2
	..E
	Error: test_spec {Spot price history } 004 [should be able to be requested with
	various instance types](Spot price history ): NoMethodError: undefined method `stubs'
	for #<AWS::EC2::Base:0x08c39044>
	/usr/src/RPM/BUILD/amazon-ec2-0.9.17/test/test_EC2_spot_prices.rb:45:in `block (3 levels)
	in <top (required)>'
	--
	..E
	Error: test_spec {The EC2 subnets } 001 [should be able to be described with no params
	and return a subnetSet](The EC2 subnets ): NoMethodError: undefined method `stubs'
	for #<AWS::EC2::Base:0x08c144ec>
	/usr/src/RPM/BUILD/amazon-ec2-0.9.17/test/test_EC2_subnets.rb:45:in `block (2 levels)
	in <top (required)>'
	E
	Error: test_spec {The EC2 subnets } 002 [should be able to be described with
	describe_subnet](The EC2 subnets ): NoMethodError: undefined method `stubs' for
	#<AWS::EC2::Base:0x08bf08a8>
	/usr/src/RPM/BUILD/amazon-ec2-0.9.17/test/test_EC2_subnets.rb:52:in `block (2 levels)
	in <top (required)>'
	E
	Error: test_spec {EC2 volumes } 001 [should be able to be described with
	describe_volumes](EC2 volumes ): NoMethodError: undefined method `stubs' for
	#<AWS::EC2::Base:0x08bcf07c>
	/usr/src/RPM/BUILD/amazon-ec2-0.9.17/test/test_EC2_volumes.rb:81:in `block (2 levels)
	in <top (required)>'
	E
	Error: test_spec {EC2 volumes } 002 [should be able to be created with an
	availability_zone with size](EC2 volumes ): NoMethodError: undefined method `stubs'
	for #<AWS::EC2::Base:0x08bbd0e8>
	/usr/src/RPM/BUILD/amazon-ec2-0.9.17/test/test_EC2_volumes.rb:94:in `block (2 levels)
	in <top (required)>'
	E
	Error: test_spec {EC2 volumes } 003 [should be able to be deleted with a volume_id](EC2
	volumes ): NoMethodError: undefined method `stubs' for #<AWS::EC2::Base:0x08ba01dc>
	/usr/src/RPM/BUILD/amazon-ec2-0.9.17/test/test_EC2_volumes.rb:107:in `block (2 levels)
	in <top (required)>'
	E
	Error: test_spec {EC2 volumes } 004 [should be able to be attached with a volume_id with
	an instance_id with a device](EC2 volumes ): NoMethodError: undefined method `stubs'
	for #<AWS::EC2::Base:0x0891d0a4>
	/usr/src/RPM/BUILD/amazon-ec2-0.9.17/test/test_EC2_volumes.rb:117:in `block (2 levels)
	in <top (required)>'
	E
	Error: test_spec {EC2 volumes } 005 [should be able to be detached with a volume_id
	with an instance_id](EC2 volumes ): NoMethodError: undefined method `stubs' for
	#<AWS::EC2::Base:0x08862a38>
	/usr/src/RPM/BUILD/amazon-ec2-0.9.17/test/test_EC2_volumes.rb:130:in `block (2 levels)
	in <top (required)>'
	E
	Error: test_spec {EC2 volumes } 006 [should be able to be force detached with a string](EC2
	volumes ): NoMethodError: undefined method `stubs' for #<AWS::EC2::Base:0x086014c4>
	/usr/src/RPM/BUILD/amazon-ec2-0.9.17/test/test_EC2_volumes.rb:143:in `block (2 levels)
	in <top (required)>'
	E
	Error: test_spec {EC2 volumes } 007 [should be able to be force detached
	with a Boolean](EC2 volumes ): NoMethodError: undefined method `stubs' for
	#<AWS::EC2::Base:0x08c5b48c>
	/usr/src/RPM/BUILD/amazon-ec2-0.9.17/test/test_EC2_volumes.rb:151:in `block (2 levels)
	in <top (required)>'

	16 error logs REMOVED from the list
aircrack-ng-1.1-alt2.qa1
apr1-1.5.2-alt1
archivemail-0.9.0-alt1
dar-2.5.15-alt1
holotz-castle-1.3.14-alt2.qa1
jed-2:0.99.19-alt2.qa2.1
llvm6.0-6.0.0-alt0.8.rel
lshw-2.18-alt1
opendx-4.4.4-alt7
perl-Wx-0.9932-alt2.1
poco-1.9.0-alt1
pylint-1.9.1-alt1.S1
python-module-etcd-0.4.5-alt3.S1
python-module-greenhouse-2.2.0-alt2.git20141230.1
python-module-requirements-detector-0.5.2-alt1.1
sgc-0.2.1-alt1

Total 481 error logs.


Sisyphus-cybertalk