[cyber] I: Sisyphus-20180606 x86_64 beehive_status: +32 -32 (458)

ALT beekeeper hiver altlinux.org
6 08:02:57 MSK 2018


	32 NEW error logs

LibreOffice-6.0.1.1-alt1.2
	[build CXX] sc/source/ui/docshell/docsh4.cxx
	make[1]: Leaving directory '/usr/src/RPM/BUILD/libreoffice-6.0.1.1'
	make[1]: Entering directory '/usr/src/RPM/BUILD/libreoffice-6.0.1.1'
	[build CXX] sc/source/ui/docshell/externalrefmgr.cxx
	make[1]: Leaving directory '/usr/src/RPM/BUILD/libreoffice-6.0.1.1'
	make[1]: Entering directory '/usr/src/RPM/BUILD/libreoffice-6.0.1.1'
	[build CXX] sc/source/core/tool/scmatrix.cxx
	make[1]: Leaving directory '/usr/src/RPM/BUILD/libreoffice-6.0.1.1'
	make: *** [Makefile:268: build] Error 2
	make: Leaving directory '/usr/src/RPM/BUILD/libreoffice-6.0.1.1'

LibreOffice-still-5.4.7.2-alt1.1
	[build CXX] sw/source/core/frmedt/tblsel.cxx
	make[1]: Leaving directory '/usr/src/RPM/BUILD/libreoffice-5.4.7.2'
	make[1]: Entering directory '/usr/src/RPM/BUILD/libreoffice-5.4.7.2'
	[build CXX] sw/source/core/frmedt/feshview.cxx
	make[1]: Leaving directory '/usr/src/RPM/BUILD/libreoffice-5.4.7.2'
	make[1]: Entering directory '/usr/src/RPM/BUILD/libreoffice-5.4.7.2'
	[build CXX] sw/source/core/frmedt/fecopy.cxx
	make[1]: Leaving directory '/usr/src/RPM/BUILD/libreoffice-5.4.7.2'
	make: *** [Makefile:270: build] Error 2
	make: Leaving directory '/usr/src/RPM/BUILD/libreoffice-5.4.7.2'

aprutil1-1.5.4-alt1
	Processing files: libaprutil1-mysql-1.5.4-alt1
	error: File not found by glob:
	/usr/src/tmp/aprutil1-buildroot/usr/lib64/apr-util-1/apr_dbd_mysql*.so
	RPM build errors:

barnyard2-2.1.13-alt4.qa1
	libmysqlclient20-devel: Conflicts: libmariadb-devel
	E: Broken packages
	hsh-install: Failed to calculate package file list.

doublecmd-0.8.2-alt2
	/usr/lib64/lazarus/lcl/interfaces/./qt/alllclintfunits.pas(32,3) Подсказка:
	(5023) Модуль "QtWSStdCtrls" не используется в AllLCLIntfUnits
	(1008) 64621 строк скомпилиpовано, 1.8 сек.
	(1021) 78 предупреждений
	(1022) 357 подсказок
	(1023) 23An unhandled exception occurred at $000000000053DF03:
	EAccessViolation: Access violation
	$000000000053DF03
	$0000000000575E75
	$0000000000579F37
	$000000000057B141

exim-4.90.1-alt1
	libmysqlclient20-devel: Conflicts: libmariadb-devel
	E: Broken packages
	hsh-install: Failed to calculate package file list.

fsharp-4.0.0.4-alt2.S1
	TIME:  0.3 Delta:  0.0 Mem:
	Task "Fsc" execution -- FAILED
	Done building target "CoreCompile" in project
	"/usr/src/RPM/BUILD/fsharp-4.0.0.4/src/fsharp/FSharp.Core/FSharp.Core.fsproj".-- FAILED
	Done building project
	"/usr/src/RPM/BUILD/fsharp-4.0.0.4/src/fsharp/FSharp.Core/FSharp.Core.fsproj".-- FAILED
	Build FAILED.
	Errors:

gearmand-1.1.18-alt1
	no
	configure: error: Unable to find either openssl or wolfssl

golang-github-xiang90-probing-0-alt1_0.6.git07dd2e8
	+ go test -compiler gc github.com/xiang90/probing
	--- FAIL: TestProbe (0.20s)
	prober_test.go:37: total = 140, want around 200

grass-7.4.0-alt1
	Selecting libproj-devel for 'proj-devel'
	E: Couldn't find package libmysqld-devel
	hsh-install: Failed to calculate package file list.

kde5-kdb-3.1.0-alt1.S1
	Selecting libmariadb-devel for 'libmysqlclient-devel'
	E: Couldn't find package libmysqld-devel
	hsh-install: Failed to calculate package file list.

kexi-3.1.0-alt1.S1
	Selecting libmariadb-devel for 'libmysqlclient-devel'
	E: Couldn't find package libmysqld-devel
	hsh-install: Failed to calculate package file list.

libgtk-sharp2-2.12.11-alt5.S1
	a fatal error in the mono runtime or one of the native libraries
	used by your application.
	make[3]: *** [Makefile:699: calendar.exe] Aborted
	make[3]: Leaving directory '/usr/src/RPM/BUILD/libgtk-sharp2-2.12.11/sample'
	make[2]: *** [Makefile:427: all-recursive] Error 1
	make[2]: Leaving directory '/usr/src/RPM/BUILD/libgtk-sharp2-2.12.11/sample'
	make[1]: *** [Makefile:444: all-recursive] Error 1
	make[1]: Leaving directory '/usr/src/RPM/BUILD/libgtk-sharp2-2.12.11'
	make: *** [Makefile:371: all] Error 2
	make: Leaving directory '/usr/src/RPM/BUILD/libgtk-sharp2-2.12.11'

libnss-mysql-1.6-alt6
	D ("%s: Connecting to %s", FUNCNAME, server->host);
	mysql.c:247:14: error: 'MYSQL {aka struct st_mysql}' has no member named 'reconnect'
	ci.link.reconnect = 0; /* Safety: We can't let MySQL assume socket is

llvm4.0-4.0.1-alt3.rel
	../tools/clang/lib/Sema/SemaTemplate.cpp: In member function 'bool
	clang::Sema::CheckSpecializationInstantiationRedecl(clang::SourceLocation,
	clang::TemplateSpecializationKind, clang::NamedDecl*, clang::TemplateSpecializationKind,
	clang::SourceLocation, bool&)':
	../tools/clang/lib/Sema/SemaTemplate.cpp:6940:5: warning: this statement may fall through
	[-Wimplicit-fallthrough=]
	../tools/clang/lib/Sema/SemaTemplate.cpp:6942:3: note: here
	case TSK_ExplicitInstantiationDeclaration:
	../tools/clang/lib/Sema/SemaTemplate.cpp: In member function 'clang::QualType
	clang::Sema::CheckTypenameType(clang::ElaboratedTypeKeyword, clang::SourceLocation,
	clang::NestedNameSpecifierLoc, const clang::IdentifierInfo&, clang::SourceLocation)':
	../tools/clang/lib/Sema/SemaTemplate.cpp:8657:5: warning: this statement may fall through
	[-Wimplicit-fallthrough=]
	../tools/clang/lib/Sema/SemaTemplate.cpp:8662:3: note: here
	case LookupResult::NotFoundInCurrentInstantiation:
	[1567/2106] Building CXX object
	tools/clang/lib/Sema/CMakeFiles/clangSema.dir/SemaExprCXX.cpp.o
	ninja: build stopped: subcommand failed.

make-2:4.2.1-alt2
	Caught signal 14!
	FAILED (13/15 passed)
	features/override ....................................... ok	 (4 passed)

maven-doxia-0:1.7-alt1_5jpp8
	at
	org.apache.maven.doxia.module.markdown.MarkdownParserTest.setUp(MarkdownParserTest.java:55)
	Caused by: java.lang.NoClassDefFoundError: Could not initialize class
	org.apache.maven.doxia.module.markdown.MarkdownParser
	at
	org.apache.maven.doxia.module.markdown.MarkdownParserTest.setUp(MarkdownParserTest.java:55)
	[ERROR] testMetadataSinkEvent(org.apache.maven.doxia.module.markdown.MarkdownParserTest)
	Time elapsed: 0.006 s  <<< ERROR!
	org.codehaus.plexus.component.repository.exception.ComponentLookupException:
	--
	at
	org.apache.maven.doxia.module.markdown.MarkdownParserTest.setUp(MarkdownParserTest.java:55)
	Caused by: java.lang.NoClassDefFoundError: Could not initialize class
	org.apache.maven.doxia.module.markdown.MarkdownParser
	at
	org.apache.maven.doxia.module.markdown.MarkdownParserTest.setUp(MarkdownParserTest.java:55)
	[ERROR] testLinkSinkEvent(org.apache.maven.doxia.module.markdown.MarkdownParserTest)
	Time elapsed: 0.006 s  <<< ERROR!
	org.codehaus.plexus.component.repository.exception.ComponentLookupException:
	--
	at
	org.apache.maven.doxia.module.markdown.MarkdownParserTest.setUp(MarkdownParserTest.java:55)
	Caused by: java.lang.NoClassDefFoundError: Could not initialize class
	org.apache.maven.doxia.module.markdown.MarkdownParser
	at
	org.apache.maven.doxia.module.markdown.MarkdownParserTest.setUp(MarkdownParserTest.java:55)
	[ERROR] testItalicSinkEvent(org.apache.maven.doxia.module.markdown.MarkdownParserTest)
	Time elapsed: 0.006 s  <<< ERROR!
	org.codehaus.plexus.component.repository.exception.ComponentLookupException:
	--
	at
	org.apache.maven.doxia.module.markdown.MarkdownParserTest.setUp(MarkdownParserTest.java:55)
	Caused by: java.lang.NoClassDefFoundError: Could not initialize class
	org.apache.maven.doxia.module.markdown.MarkdownParser
	at
	org.apache.maven.doxia.module.markdown.MarkdownParserTest.setUp(MarkdownParserTest.java:55)
	[ERROR] testBoldSinkEvent(org.apache.maven.doxia.module.markdown.MarkdownParserTest)
	Time elapsed: 0.006 s  <<< ERROR!
	org.codehaus.plexus.component.repository.exception.ComponentLookupException:
	--
	at
	org.apache.maven.doxia.module.markdown.MarkdownParserTest.setUp(MarkdownParserTest.java:55)
	Caused by: java.lang.NoClassDefFoundError: Could not initialize class
	org.apache.maven.doxia.module.markdown.MarkdownParser
	at
	org.apache.maven.doxia.module.markdown.MarkdownParserTest.setUp(MarkdownParserTest.java:55)
	[ERROR] testDocument(org.apache.maven.doxia.module.markdown.MarkdownParserTest)  Time
	elapsed: 0.004 s  <<< ERROR!
	org.codehaus.plexus.component.repository.exception.ComponentLookupException:

mono-5.10.0.157-alt4.S1
	make[6]: *** [../build/rules.make:232: all-recursive] Error 1
	make[5]: *** [build/rules.make:232: all-recursive] Error 1
	make[4]: *** [Makefile:54: profile-do--build--all] Error 2
	make[3]: *** [Makefile:50: profiles-do--all] Error 2
	make[2]: *** [Makefile:596: all-local] Error 2
	make[2]: Leaving directory '/usr/src/RPM/BUILD/mono-5.10.0.157/runtime'
	make[1]: *** [Makefile:543: all-recursive] Error 1
	make[1]: Leaving directory '/usr/src/RPM/BUILD/mono-5.10.0.157'
	make: *** [Makefile:472: all] Error 2
	make: Leaving directory '/usr/src/RPM/BUILD/mono-5.10.0.157'

mysql-workbench-community-6.3.4-alt3
	from
	/usr/src/RPM/BUILD/mysql-workbench-community-6.3.4/library/sql.parser/source/charset-def.cpp:17:
	/usr/src/RPM/BUILD/mysql-workbench-community-6.3.4/library/sql.parser/source/./my_global.h:926:2:
	error: #error "Neither int or long is of 4 bytes width"
	#error "Neither int or long is of 4 bytes width"
	--
	from
	/usr/src/RPM/BUILD/mysql-workbench-community-6.3.4/library/sql.parser/source/charset-def.cpp:17:
	/usr/src/RPM/BUILD/mysql-workbench-community-6.3.4/library/sql.parser/source/./my_global.h:643:9:
	error: 'SOCKET_SIZE_TYPE' does not name a type; did you mean 'SOCKET_EINTR'?
	typedef SOCKET_SIZE_TYPE size_socket;
	--
	#define strtok_r(A,B,C) strtok((A),(B))
	/usr/src/RPM/BUILD/mysql-workbench-community-6.3.4/library/sql.parser/source/./my_global.h:777:31:
	error: 'char* strtok' redeclared as different kind of symbol
	In file included from
	/usr/src/RPM/BUILD/mysql-workbench-community-6.3.4/library/sql.parser/source/./my_sys.h:20:0,
	--
	from
	/usr/src/RPM/BUILD/mysql-workbench-community-6.3.4/library/sql.parser/source/charset-def.cpp:17:
	/usr/include/string.h:345:14: error: expected primary-expression before 'char'
	extern char *strtok_r (char *__restrict __s, const char *__restrict __delim,
	/usr/include/string.h:345:14: error: expected ')' before 'char'
	In file included from
	/usr/src/RPM/BUILD/mysql-workbench-community-6.3.4/library/sql.parser/source/mysys_priv.h:18:0,
	--
	/usr/src/RPM/BUILD/mysql-workbench-community-6.3.4/library/sql.parser/source/./my_sys.h:
	In function 'int mysql_parser::my_close(int, myf)':
	/usr/src/RPM/BUILD/mysql-workbench-community-6.3.4/library/sql.parser/source/./my_sys.h:24:59:
	error: 'close' was not declared in this scope
	static inline int my_close(int file, myf unused) { return close(file); }
	--
	/usr/src/RPM/BUILD/mysql-workbench-community-6.3.4/library/sql.parser/source/./my_sys.h:
	In function 'int mysql_parser::my_open(const char*, int, int)':
	/usr/src/RPM/BUILD/mysql-workbench-community-6.3.4/library/sql.parser/source/./my_sys.h:25:80:
	error: 'open' was not declared in this scope
	static inline int my_open(const char *FileName,int Flags, int unused) { return
	open(FileName, Flags); }
	--
	/usr/src/RPM/BUILD/mysql-workbench-community-6.3.4/library/sql.parser/source/./my_sys.h:
	At global scope:
	/usr/src/RPM/BUILD/mysql-workbench-community-6.3.4/library/sql.parser/source/./my_sys.h:575:9:
	error: 'uint32' does not name a type; did you mean 'uint16'?
	typedef uint32 ha_checksum;
	--
	from
	/usr/src/RPM/BUILD/mysql-workbench-community-6.3.4/library/sql.parser/source/charset-def.cpp:17:
	/usr/src/RPM/BUILD/mysql-workbench-community-6.3.4/library/sql.parser/source/./my_global.h:609:21:
	error: 'RETSIGTYPE' has not been declared
	#define sig_handler RETSIGTYPE
	--
	extern void my_remember_signal(int signal_number,sig_handler (*func)(int));
	/usr/src/RPM/BUILD/mysql-workbench-community-6.3.4/library/sql.parser/source/./my_global.h:609:21:
	error: 'RETSIGTYPE' does not name a type
	#define sig_handler RETSIGTYPE

net-snmp30-5.7.3-alt3.1
	libtool: link: x86_64-alt-linux-gcc -pipe -frecord-gcc-switches -Wall -g
	-O2 -DNETSNMP_ENABLE_IPV6 -fno-strict-aliasing -DNETSNMP_REMOVE_U64 -pipe
	-frecord-gcc-switches -Wall -g -O2 -Ulinux -Dlinux=linux -D_REENTRANT -D_GNU_SOURCE
	-fwrapv -fno-strict-aliasing -pipe -fstack-protector-strong -I/usr/local/include
	-D_LARGEFILE_SOURCE -D_FILE_OFFSET_BITS=64 -I/usr/lib64/perl5/CORE
	-Wall -Wstrict-prototypes -Wwrite-strings -Wcast-qual -o .libs/snmptrapd
	.libs/snmptrapd.o -Wl,-E  ./.libs/libnetsnmptrapd.so ../agent/.libs/libnetsnmpmibs.so
	../agent/.libs/libnetsnmpagent.so ../snmplib/.libs/libnetsnmp.so -L/usr/lib64/ -lmariadb
	-lz -ldl -lpthread -lssl -lnl-3 -lm -lcrypto -lwrap
	./.libs/libnetsnmptrapd.so: undefined reference to `load_defaults'
	./.libs/libnetsnmptrapd.so: undefined reference to `my_init'
	collect2: error: ld returned 1 exit status
	make[1]: *** [Makefile:294: snmptrapd] Error 1

perl-Convert-PEM-0.08-alt1
	Possible precedence issue with control flow operator at
	/usr/src/RPM/BUILD/Convert-PEM-0.08/inc/Test/Builder.pm line 858.
	#   Failed test 'errstr matches decryption failed'
	#   at t/01-readwrite.t line 32.
	--
	t/01-readwrite.t (Wstat: 256 Tests: 16 Failed: 1)
	Failed test:  10
	Non-zero exit status: 1
	--
	Result: FAIL
	Failed 1/5 test programs. 1/36 subtests failed.
	make: *** [Makefile:780: test_dynamic] Error 255

perl-DBD-mysql-4.046-alt1
	Binary file (standard input) matches

php5-mysql-5.6.36.20180425-alt1.S1
	checking for the location of libz... no
	configure: error: Cannot find libmysqlclient_r under /usr.
	Note that the MySQL client library is not bundled anymore!

php5-mysqli-5.6.36.20180425-alt1.S1
	In file included from /usr/src/RPM/BUILD/php5-mysqli-5.6.36.20180425/mysqli.c:34:0:
	/usr/src/RPM/BUILD/php5-mysqli-5.6.36.20180425/php_mysqli_structs.h:82:10: fatal error:
	my_list.h: No such file or directory
	#include <my_list.h>

php7-mysqli-7.2.6-alt1.S1
	In file included from /usr/src/RPM/BUILD/php7-mysqli-7.2.6/mysqli.c:34:0:
	/usr/src/RPM/BUILD/php7-mysqli-7.2.6/php_mysqli_structs.h:82:10: fatal error: my_list.h:
	No such file or directory
	#include <my_list.h>

python-module-MySQLdb-1:1.2.5-alt1.1.1.1
	@@ -42,7 +42,7 @@
	except ImportError:
	# Python 3
	--
	_mysql.c: In function '_mysql_ConnectionObject_ping':
	_mysql.c:2005:41: error: 'MYSQL {aka struct st_mysql}' has no member named 'reconnect'
	if ( reconnect != -1 ) self->connection.reconnect = reconnect;
	error: command 'x86_64-alt-linux-gcc' failed with exit status 1
	error: Bad exit status from /usr/src/tmp/rpm-tmp.78724 (%build)

python-module-MySQLdb2-1.3.0-alt3.hg20110907
	src/connections.c: In function '_mysql_ConnectionObject_ping':
	src/connections.c:799:41: error: 'MYSQL {aka struct st_mysql}' has no member named
	'reconnect'
	if ( reconnect != -1 ) self->connection.reconnect = reconnect;
	error: command 'x86_64-alt-linux-gcc' failed with exit status 1

python-module-pexpect-4.4-alt1.S1
	>	self.assertEqual(child.exitstatus, 0)
	E	AssertionError: None != 0
	tests/test_env.py:68: AssertionError

python-module-scikits.fitting-1:0.6-alt2
	Utils: Test squash and unsquash. ... ok
	FAIL: NonLinearLeastSquaresFit: Compare to LinearLeastSquaresFit on a linear problem
	and check use of Jacobian.
	Traceback (most recent call last):
	--
	raise AssertionError(msg)
	AssertionError:
	Arrays are not almost equal to 6 decimals
	--
	Ran 31 tests in 1.579s
	FAILED (failures=1)

sgc-0.2.1-alt1
	pygame.display.init()
	error: Couldn't open X11 display
	The full traceback has been saved in /usr/src/tmp/sphinx-err-mcLuLI.log, if you want
	to report the issue to the developers.

stardict-3.0.6-alt1
	wikipediaImage.cpp: In function 'void dump_file()':
	wikipediaImage.cpp:34:76: error: 'MYSQL_PORT' was not declared in this scope
	if (!mysql_real_connect(&mysql, CONN_HOST , CONN_USER , CONN_PASS, NULL , MYSQL_PORT,
	NULL, 0))

zarafa-7.1.15-alt19.S1
	ECDatabaseMySQL.cpp: In member function 'ECRESULT ECDatabaseMySQL::InitEngine()':
	ECDatabaseMySQL.cpp:109:12: error: 'MYSQL {aka struct st_mysql}' has no member named
	'reconnect'
	m_lpMySQL.reconnect = 1;

	32 error logs REMOVED from the list
atlas-3.9.35-alt1.qa1
avogadro-1.2.0-alt3.S1
cross-gcc-7.1.1-alt1_3
freecad-1:0.17-alt4
gr-osmosdr-0.1.4-alt3.20170612.S1
gradle-4.3.1-alt1_7jpp8
guile22-2.2.2-alt1
kde4edu-15.12.3-alt6.S1
kde5-kig-18.04.1-alt1.S1
kde5-kopete-18.04.0-alt1.S1
keepass-2.39-alt1.S1
krb5user-0.1.2-alt3.qa2
ledger-3.1.aed3709-alt2
libpst-0.6.68-alt2
linuxcnc-2.7.13-alt1
netgen-6.1-alt1.dev.git20150306.qa5
omnibus-software-4.0.0-alt1.gita5aef20
perl-HTML-Widget-1.11-alt3
perl-IO-Event-0.813-alt2
perl-Log-Dispatch-FileRotate-1.35-alt1
pgtcl-1.6.2-alt3
python-module-IceSSL-0.0.5-alt4.4.qa6
python-module-cyrand-0.3-alt1.git20150228.1.1.1
python-module-joblib-0.11-alt2
python-module-kadmin5-0.0.5-alt6
python-module-meshpy-2014.1-alt3.git20140706.1.1
python-module-pyexiv2-0.3.2-alt3.bzr20120921.0
python-module-pyublas-2013.1-alt1.git20140620.1.1.1
python-module-tagpy-2013.1-alt2.git20130711.1.1.1.1.1
racket-6.10.1-alt1
rstudio-0.98.501-alt2
vegastrike-0.5.1-alt7_31.r1

Total 458 error logs.


Sisyphus-cybertalk