[cyber] I: Sisyphus-20180704 x86_64 beehive_status: +14 -15 (1065)

ALT beekeeper hiver altlinux.org
4 06:31:25 MSK 2018


	14 NEW error logs

bijiben-3.28.3-alt1
	[4/75] Compiling C object 'src/src@@bijiben  exe/bjb-settings.c.o'.
	FAILED: src/src@@bijiben  exe/bjb-settings.c.o
	cc -Isrc/src@@bijiben  exe -Isrc -I../src -I. -I../ -Isrc/libbiji -I../src/libbiji
	-Isubprojects/libgd -I../subprojects/libgd -I/usr/include/gtk-3.0
	-I/usr/include/gio-unix-2.0/ -I/usr/include/pango-1.0 -I/usr/include/fribidi
	-I/usr/include/atk-1.0 -I/usr/include/cairo -I/usr/include/freetype2
	-I/usr/include/harfbuzz -I/usr/include/libpng15 -I/usr/include/gdk-pixbuf-2.0
	-I/usr/include/glib-2.0 -I/usr/lib64/glib-2.0/include -I/usr/include/tracker-2.0
	-I/usr/include/tracker-2.0/libtracker-sparql -I/usr/include/goa-1.0
	-I/usr/lib64/goa-1.0/include -I/usr/include/evolution-data-server -I/usr/include/nss
	-I/usr/include/nspr -I/usr/include/libsecret-1 -I/usr/include/libsoup-2.4
	-I/usr/include/libxml2 -I/usr/include/uuid -I/usr/include/webkitgtk-4.0
	-I/usr/include/zeitgeist-2.0 -fdiagnostics-color=always -pipe -D_FILE_OFFSET_BITS=64
	-DHAVE_CONFIG_H '-DDATADIR="/usr/share"' '-DPACKAGE_LOCALE_DIR="/usr/share/locale"'
	-frecord-gcc-switches -Wall -g -O2 -pthread -DLIBGD_GTK_HACKS=1 -DLIBGD__VIEW_COMMON=1
	-DLIBGD_MAIN_ICON_VIEW=1 -DLIBGD_MAIN_LIST_VIEW=1 -DLIBGD_MAIN_VIEW=1
	-DLIBGD_TAGGED_ENTRY=1	-MD -MQ 'src/src@@bijiben  exe/bjb-settings.c.o' -MF
	'src/src@@bijiben  exe/bjb-settings.c.o.d' -o 'src/src@@bijiben  exe/bjb-settings.c.o'
	-c ../src/bjb-settings.c
	--
	from ../src/bjb-settings.c:22:
	../src/libbiji/libbiji.h:25:10: fatal error: biji-marshalers.h: No such file or directory
	#include "biji-marshalers.h"
	--
	[6/75] Compiling C object 'src/src@@bijiben  exe/bjb-editor-toolbar.c.o'.
	FAILED: src/src@@bijiben  exe/bjb-editor-toolbar.c.o
	cc -Isrc/src@@bijiben  exe -Isrc -I../src -I. -I../ -Isrc/libbiji -I../src/libbiji
	-Isubprojects/libgd -I../subprojects/libgd -I/usr/include/gtk-3.0
	-I/usr/include/gio-unix-2.0/ -I/usr/include/pango-1.0 -I/usr/include/fribidi
	-I/usr/include/atk-1.0 -I/usr/include/cairo -I/usr/include/freetype2
	-I/usr/include/harfbuzz -I/usr/include/libpng15 -I/usr/include/gdk-pixbuf-2.0
	-I/usr/include/glib-2.0 -I/usr/lib64/glib-2.0/include -I/usr/include/tracker-2.0
	-I/usr/include/tracker-2.0/libtracker-sparql -I/usr/include/goa-1.0
	-I/usr/lib64/goa-1.0/include -I/usr/include/evolution-data-server -I/usr/include/nss
	-I/usr/include/nspr -I/usr/include/libsecret-1 -I/usr/include/libsoup-2.4
	-I/usr/include/libxml2 -I/usr/include/uuid -I/usr/include/webkitgtk-4.0
	-I/usr/include/zeitgeist-2.0 -fdiagnostics-color=always -pipe -D_FILE_OFFSET_BITS=64
	-DHAVE_CONFIG_H '-DDATADIR="/usr/share"' '-DPACKAGE_LOCALE_DIR="/usr/share/locale"'
	-frecord-gcc-switches -Wall -g -O2 -pthread -DLIBGD_GTK_HACKS=1 -DLIBGD__VIEW_COMMON=1
	-DLIBGD_MAIN_ICON_VIEW=1 -DLIBGD_MAIN_LIST_VIEW=1 -DLIBGD_MAIN_VIEW=1
	-DLIBGD_TAGGED_ENTRY=1	-MD -MQ 'src/src@@bijiben  exe/bjb-editor-toolbar.c.o'
	-MF 'src/src@@bijiben  exe/bjb-editor-toolbar.c.o.d' -o
	'src/src@@bijiben  exe/bjb-editor-toolbar.c.o' -c ../src/bjb-editor-toolbar.c
	In file included from ../src/bjb-editor-toolbar.c:25:0:
	../src/libbiji/libbiji.h:25:10: fatal error: biji-marshalers.h: No such file or directory
	#include "biji-marshalers.h"
	--
	[7/75] Compiling C object 'src/src@@bijiben  exe/bjb-search-toolbar.c.o'.
	FAILED: src/src@@bijiben  exe/bjb-search-toolbar.c.o
	cc -Isrc/src@@bijiben  exe -Isrc -I../src -I. -I../ -Isrc/libbiji -I../src/libbiji
	-Isubprojects/libgd -I../subprojects/libgd -I/usr/include/gtk-3.0
	-I/usr/include/gio-unix-2.0/ -I/usr/include/pango-1.0 -I/usr/include/fribidi
	-I/usr/include/atk-1.0 -I/usr/include/cairo -I/usr/include/freetype2
	-I/usr/include/harfbuzz -I/usr/include/libpng15 -I/usr/include/gdk-pixbuf-2.0
	-I/usr/include/glib-2.0 -I/usr/lib64/glib-2.0/include -I/usr/include/tracker-2.0
	-I/usr/include/tracker-2.0/libtracker-sparql -I/usr/include/goa-1.0
	-I/usr/lib64/goa-1.0/include -I/usr/include/evolution-data-server -I/usr/include/nss
	-I/usr/include/nspr -I/usr/include/libsecret-1 -I/usr/include/libsoup-2.4
	-I/usr/include/libxml2 -I/usr/include/uuid -I/usr/include/webkitgtk-4.0
	-I/usr/include/zeitgeist-2.0 -fdiagnostics-color=always -pipe -D_FILE_OFFSET_BITS=64
	-DHAVE_CONFIG_H '-DDATADIR="/usr/share"' '-DPACKAGE_LOCALE_DIR="/usr/share/locale"'
	-frecord-gcc-switches -Wall -g -O2 -pthread -DLIBGD_GTK_HACKS=1 -DLIBGD__VIEW_COMMON=1
	-DLIBGD_MAIN_ICON_VIEW=1 -DLIBGD_MAIN_LIST_VIEW=1 -DLIBGD_MAIN_VIEW=1
	-DLIBGD_TAGGED_ENTRY=1	-MD -MQ 'src/src@@bijiben  exe/bjb-search-toolbar.c.o'
	-MF 'src/src@@bijiben  exe/bjb-search-toolbar.c.o.d' -o
	'src/src@@bijiben  exe/bjb-search-toolbar.c.o' -c ../src/bjb-search-toolbar.c
	--
	from ../src/bjb-search-toolbar.c:32:
	../src/libbiji/libbiji.h:25:10: fatal error: biji-marshalers.h: No such file or directory
	#include "biji-marshalers.h"

bitlbee-facebook-1.1.2-alt1.g553593d
	aclocal-default: warning: couldn't open directory 'm4': No such file or directory
	autoreconf-default: configure.ac: tracing
	--
	facebook-api.c: In function 'fb_api_class_init':
	facebook-api.c:355:18: error: 'fb_marshal_VOID__VOID' undeclared (first use in this
	function); did you mean 'g_cclosure_marshal_VOID__VOID'?
	fb_marshal_VOID__VOID,
	--
	facebook-api.c:355:18: note: each undeclared identifier is reported only once for each
	function it appears in
	facebook-api.c:388:18: error: 'fb_marshal_VOID__POINTER' undeclared (first use in this
	function); did you mean 'fb_marshal_VOID__VOID'?
	fb_marshal_VOID__POINTER,
	fb_marshal_VOID__VOID
	facebook-api.c:409:18: error: 'fb_marshal_VOID__POINTER_BOOLEAN' undeclared (first use
	in this function); did you mean 'fb_marshal_VOID__POINTER'?
	fb_marshal_VOID__POINTER_BOOLEAN,
	fb_marshal_VOID__POINTER
	facebook-api.c:426:18: error: 'fb_marshal_VOID__POINTER_POINTER' undeclared (first use
	in this function); did you mean 'fb_marshal_VOID__POINTER_BOOLEAN'?
	fb_marshal_VOID__POINTER_POINTER,
	fb_marshal_VOID__POINTER_BOOLEAN
	facebook-api.c:526:18: error: 'fb_marshal_VOID__INT64' undeclared (first use in this
	function); did you mean 'fb_marshal_VOID__POINTER'?
	fb_marshal_VOID__INT64,
	--
	facebook-mqtt.c: In function 'fb_mqtt_class_init':
	facebook-mqtt.c:88:18: error: 'fb_marshal_VOID__VOID' undeclared (first use in this
	function); did you mean 'g_cclosure_marshal_VOID__VOID'?
	fb_marshal_VOID__VOID,
	--
	facebook-mqtt.c:88:18: note: each undeclared identifier is reported only once for each
	function it appears in
	facebook-mqtt.c:105:18: error: 'fb_marshal_VOID__OBJECT' undeclared (first use in this
	function); did you mean 'fb_marshal_VOID__VOID'?
	fb_marshal_VOID__OBJECT,
	fb_marshal_VOID__VOID
	facebook-mqtt.c:139:18: error: 'fb_marshal_VOID__STRING_BOXED' undeclared (first use
	in this function); did you mean 'fb_marshal_VOID__VOID'?
	fb_marshal_VOID__STRING_BOXED,

fsharp-4.0.0.4-alt2.S1
	a fatal error in the mono runtime or one of the native libraries
	used by your application.
	make[3]: *** [/usr/src/RPM/BUILD/fsharp-4.0.0.4//src/fsharp/targets.make:6: build] Aborted
	make[3]: Leaving directory '/usr/src/RPM/BUILD/fsharp-4.0.0.4/src/fsharp/Fsc'
	make[2]: *** [Makefile:32: build] Error 2
	make[2]: Leaving directory '/usr/src/RPM/BUILD/fsharp-4.0.0.4/src/fsharp'
	make[1]: *** [Makefile:11: all] Error 2
	make[1]: Leaving directory '/usr/src/RPM/BUILD/fsharp-4.0.0.4/src/fsharp'
	make: *** [Makefile:4: all] Error 2
	make: Leaving directory '/usr/src/RPM/BUILD/fsharp-4.0.0.4'

kernel-modules-wireguard-std-def-0.0.20180413-alt1.k.264558.1
	Selected version kernel-headers-modules-std-def#1:4.9.110-alt1 for
	kernel-headers-modules-std-def=4.9.110-alt1
	E: Version ='0.0.20180413' for 'kernel-source-wireguard' was not found
	hsh-install: Failed to calculate package file list.

kernel-modules-wireguard-un-def-0.0.20180413-alt1.k.266500.1
	Selected version kernel-headers-modules-un-def#1:4.17.4-alt1 for
	kernel-headers-modules-un-def=4.17.4-alt1
	E: Version ='0.0.20180413' for 'kernel-source-wireguard' was not found
	hsh-install: Failed to calculate package file list.

make-2:4.2.1-alt2
	Caught signal 14!
	FAILED (14/15 passed)
	features/override ....................................... ok	 (4 passed)

meschach-1.2-alt1.b.3
	Verifying ELF objects in /usr/src/tmp/meschach-buildroot
	(arch=normal,fhs=normal,lfs=relaxed,lint=relaxed,rpath=normal,stack=normal,textrel=normal,unresolved=normal)
	verify-elf: ERROR: ./usr/lib64/libmeschach.so.0: undefined symbol: bd_free
	verify-elf: ERROR: ./usr/lib64/libmeschach.so.0: undefined symbol: Usolve
	verify-elf: ERROR: ./usr/lib64/libmeschach.so.0: undefined symbol: trieig
	verify-elf: ERROR: ./usr/lib64/libmeschach.so.0: undefined symbol: square
	verify-elf: ERROR: ./usr/lib64/libmeschach.so.0: undefined symbol: rot_vec
	verify-elf: ERROR: ./usr/lib64/libmeschach.so.0: undefined symbol: givens
	verify-elf: ERROR: ./usr/lib64/libmeschach.so.0: undefined symbol: _v_norm2

nut-2.7.4-alt1
	scan_snmp.c: In function 'try_all_oid':
	scan_snmp.c:371:8: error: 'snmp_device_table' undeclared (first use in this function);
	did you mean 'snmp_set_detail'?
	while(snmp_device_table[index].oid != NULL) {
	--
	scan_snmp.c: In function 'try_SysOID':
	scan_snmp.c:604:10: error: 'snmp_device_table' undeclared (first use in this function);
	did you mean 'snmp_set_detail'?
	while(snmp_device_table[index].oid != NULL) {

perl-Convert-PEM-0.08-alt1
	Possible precedence issue with control flow operator at
	/usr/src/RPM/BUILD/Convert-PEM-0.08/inc/Test/Builder.pm line 858.
	#   Failed test 'errstr matches decrypt failed'
	#   at t/02-encode.t line 28.
	--
	t/02-encode.t	(Wstat: 256 Tests: 9 Failed: 1)
	Failed test:  6
	Non-zero exit status: 1
	--
	Result: FAIL
	Failed 1/5 test programs. 1/36 subtests failed.
	make: *** [Makefile:780: test_dynamic] Error 255

perl-Gnome2-Canvas-1.002-alt5.1.1.1.1
	find-requires: running scripts
	(cpp,debuginfo,files,gir-js,gir-python,gir,lib,pam,perl,pkgconfig,pkgconfiglib,python,rpmlib,shebang,shell,static,symlinks,typelib)
	/usr/src/tmp/perl-Gnome2-Canvas-buildroot/usr/lib64/perl5/Gnome2/Canvas/Install/gnomecanvasperl.h:25:10:
	fatal error: gtk2perl.h: No such file or directory
	#include <gtk2perl.h>
	--
	cpp.req:
	/usr/src/tmp/perl-Gnome2-Canvas-buildroot/usr/lib64/perl5/Gnome2/Canvas/Install/gnomecanvasperl.h:
	cpp failed, trying c++ mode
	x86_64-alt-linux-cpp: error trying to exec 'cc1plus': execvp: No such file or directory
	cpp.req: WARNING:
	/usr/src/tmp/perl-Gnome2-Canvas-buildroot/usr/lib64/perl5/Gnome2/Canvas/Install/gnomecanvasperl.h:
	cpp failed
	--
	0inputs+0outputs (0major+602553minor)pagefaults 0swaps
	hasher-priv: master: idle time limit (3600 seconds) exceeded

perl-Net-Ping-2.68-alt1
	t/150_syn_inst.t ...... ok
	#   Failed test 'Make sure it died for a good excuse'
	#   at t/190_alarm.t line 51.
	--
	t/190_alarm.t	    (Wstat: 256 Tests: 6 Failed: 1)
	Failed test:  6
	Non-zero exit status: 1
	--
	Result: FAIL
	Failed 1/17 test programs. 1/66 subtests failed.
	make: *** [Makefile:784: test_dynamic] Error 255

qslave-1.0.2-alt1.S1
	g++ -Wl,-O1 -o ../../bin/qslave-gui main.o mainwindow.o qrc_qslave.o moc_mainwindow.o
	-L../../lib -lmodbus -lCfgReader -lQt5Widgets -lQt5Gui -lQt5SerialPort -lQt5Xml -lQt5Core
	-lGL -lpthread
	/usr/bin/ld: cannot find -lmodbus
	collect2: error: ld returned 1 exit status
	make[1]: *** [Makefile:147: ../../bin/qslave-gui] Error 1

transgui-5.15.4-alt1.S1
	(3104) Компиляция trcomp.pas
	(3104) Компиляция vargrid.pas
	(3104) Компиляция varlist.pas
	/usr/src/RPM/BUILD/transgui-5.15.4/vargrid.pas(93,28) Подсказка: (5024)
	Паpаметp "Sender" не использyется
	/usr/src/RPM/BUILD/transgui-5.15.4/vargrid.pas(107An unhandled exception occurred at
	$000000000053DF03:
	EAccessViolation: Access violation
	$000000000053DF03
	$0000000000575E75
	$0000000000579F37
	$000000000057B141

zopfli-1.0.2-alt1
	squeeze.o: file not recognized: File truncated
	collect2: error: ld returned 1 exit status
	make: *** [Makefile:28: libzopfli] Error 1

	15 error logs REMOVED from the list
cinnamon-control-center-3.8.0-alt3
ddcal-0.9-alt1
gnome-flashback-3.28.0-alt1
hugin-2018.0.0-alt1.1
hyena-0.5-alt3
ipfm-0.11.5-alt1.qa1
keepass-2.39.1-alt1.S1
libgnome-sharp-2.24.2-alt3.S1
lshw-2.18-alt1
lynx-2.8.6-alt9.rel.2.2
monodevelop-6.3.0.864-alt1.S1
mysql-workbench-community-6.3.10-alt1
opencc-1.0.5-alt1
perl-Time-Format_XS-1.03-alt3.1.1.1.1
qt5-webengine-5.10.1-alt3.S1

Total 1065 error logs.


Sisyphus-cybertalk