[cyber] I: p8-20180121 i586 beehive_status: +5 -2 (927)

ALT beekeeper hiver altlinux.org
21 14:18:00 MSK 2018


	5 NEW error logs

apache-commons-io-1:2.4-alt5_14jpp8
	Results :
	Tests in error:
	FileUtilsTestCase.tearDown:110 ? IO Unable to delete directory /usr/src/RPM/BU...

apache-commons-pool2-2.4.1-alt1_1jpp8
	testBorrowObjectFairness(org.apache.commons.pool2.impl.TestGenericKeyedObjectPool)
	Time elapsed: 2.487 sec  <<< FAILURE!
	java.lang.AssertionError: Thread 27 failed: java.lang.Exception: Expected: 027 found: 028
	at org.junit.Assert.fail(Assert.java:88)
	--
	Results :
	Failed tests:
	TestGenericKeyedObjectPool.testBorrowObjectFairness:1115 Thread 27 failed:
	java.lang.Exception: Expected: 027 found: 028

doublecmd-0.7.8-alt0.M80P.1
	Фатально: (1018) Компиляция прервана
	Error: /usr/bin/ppc386 returned an error exitcode
	Error: (lazarus) Compile package cmdbox 0.0: stopped with exit code 256
	Error: (lazbuild) cmdbox 0.0 compilation failed

git-2.10.2-alt1
	ok 66 - prompt - hide if pwd ignored - inside gitdir (stderr)
	# passed all 66 test(s)
	1..66
	make[2]: Target `aggregate-results-and-cleanup' not remade because of errors.
	make[2]: Leaving directory `/usr/src/RPM/BUILD/git-2.10.2-alt1/t'
	make[1]: *** [test] Error 2
	make[1]: Target `all' not remade because of errors.
	make[1]: Leaving directory `/usr/src/RPM/BUILD/git-2.10.2-alt1/t'
	make: *** [test] Error 2
	make: Leaving directory `/usr/src/RPM/BUILD/git-2.10.2-alt1'

transgui-5.0.1-alt3
	Целевая ОС: Linux for i386
	Компиляция transgui.lpr
	Компиляция baseform.pas
	Компиляция vargrid.pas
	Компиляция varlist.pas
	vargrid.pas(543,7) Ошибка: Идентификатоp "UTF8UpperCase" не
	найден
	vargrid.pas(549,10) Ошибка: Идентификатоp "UTF8UpperCase" не
	найден
	vargrid.pas(1460) Фатально: Пpи компиляции модyля
	произошло 2 ошибок, работа прервана
	make: *** [transgui] Error 1
	make: Leaving directory `/usr/src/RPM/BUILD/transgui-5.0.1/TransGUI'

	2 error logs REMOVED from the list
perl-HTML-WikiConverter-MoinMoin-0.54-alt1.1
transmission-2.92-alt3

Total 927 error logs.


Sisyphus-cybertalk