[cyber] I: p8-20180120 x86_64 beehive_status: +6 -1 (920)

ALT beekeeper hiver altlinux.org
20 13:02:19 MSK 2018


	6 NEW error logs

archivemail-0.9.0-alt1
	................................................F..................................................
	FAIL: testJustOld (__main__.TestIsTooOld)
	with max_days=1, should be true for these dates >= 1 day
	--
	Ran 99 tests in 2.268s
	FAILED (failures=1)

doublecmd-0.7.8-alt0.M80P.1
	Фатально: (1018) Компиляция прервана
	Error: /usr/bin/ppcx64 returned an error exitcode
	Error: (lazarus) Compile package cmdbox 0.0: stopped with exit code 256
	Error: (lazbuild) cmdbox 0.0 compilation failed

libosinfo-0.2.12-alt1
	PASS: test-loader
	FAIL: test-isodetect
	SKIP: test-mediauris
	--
	# SKIP:  2
	# XFAIL: 0
	# FAIL:  1
	# XPASS: 0
	# ERROR: 0
	See test/test-suite.log

perl-HTML-WikiConverter-MoinMoin-0.54-alt1.1
	t/boilerplate.t ... ok
	#   Failed test 'table w/ attrs'
	#   at t/runtests.pl line 108.
	--
	t/moinmoin.t	(Wstat: 256 Tests: 50 Failed: 1)
	Failed test:  34
	Non-zero exit status: 1
	--
	Result: FAIL
	Failed 1/5 test programs. 1/56 subtests failed.
	make: *** [test_dynamic] Error 255

sqlcipher-3.4.1-alt0.M80P.1
	Page-cache used:      now	   0  max	   0  max-size	     4096
	Page-cache overflow:  now	   0  max    2399848
	Scratch memory used:  now	   0  max	   0
	Scratch overflow:     now	   0  max      12456  max-size	    12456
	Maximum memory usage: 2764336 bytes
	Current memory usage: 0 bytes
	Number of malloc()  : -1 calls
	error: Bad exit status from /usr/src/tmp/rpm-tmp.23843 (%check)
	RPM build errors:
	Macro %sparc not found

transgui-5.0.1-alt3
	Целевая ОС: Linux for x86-64
	Компиляция transgui.lpr
	Компиляция baseform.pas
	Компиляция vargrid.pas
	Компиляция varlist.pas
	vargrid.pas(543,7) Ошибка: Идентификатоp "UTF8UpperCase" не
	найден
	vargrid.pas(549,10) Ошибка: Идентификатоp "UTF8UpperCase" не
	найден
	vargrid.pas(1460) Фатально: Пpи компиляции модyля
	произошло 2 ошибок, работа прервана
	make: *** [transgui] Error 1
	make: Leaving directory `/usr/src/RPM/BUILD/transgui-5.0.1/TransGUI'

	1 error log REMOVED from the list
transmission-2.92-alt3

Total 920 error logs.


Sisyphus-cybertalk