[cyber] I: Sisyphus-20180119 x86_64 beehive_status: +10 -14 (422)

ALT beekeeper hiver altlinux.org
19 13:37:37 MSK 2018


	10 NEW error logs

cross-gcc-7.1.1-alt1_3
	g++ -fno-PIE -c   -pipe -frecord-gcc-switches -O2  -DIN_GCC  -DCROSS_DIRECTORY_STRUCTURE
	-fno-exceptions -fno-rtti -fasynchronous-unwind-tables -W -Wall
	-Wno-narrowing -Wwrite-strings -Wcast-qual -Wmissing-format-attribute
	-Woverloaded-virtual -pedantic -Wno-long-long -Wno-variadic-macros
	-Wno-overlength-strings   -DHAVE_CONFIG_H -I. -I. -I../../gcc-7.1.1-20170622/gcc
	-I../../gcc-7.1.1-20170622/gcc/. -I../../gcc-7.1.1-20170622/gcc/../include
	-I../../gcc-7.1.1-20170622/gcc/../libcpp/include
	-I../../gcc-7.1.1-20170622/gcc/../libdecnumber
	-I../../gcc-7.1.1-20170622/gcc/../libdecnumber/dpd -I../libdecnumber
	-I../../gcc-7.1.1-20170622/gcc/../libbacktrace	 -o data-streamer-in.o
	-MT data-streamer-in.o -MMD -MP -MF ./.deps/data-streamer-in.TPo
	../../gcc-7.1.1-20170622/gcc/data-streamer-in.c
	g++ -fno-PIE -c   -pipe -frecord-gcc-switches -O2  -DIN_GCC  -DCROSS_DIRECTORY_STRUCTURE
	-fno-exceptions -fno-rtti -fasynchronous-unwind-tables -W -Wall
	-Wno-narrowing -Wwrite-strings -Wcast-qual -Wmissing-format-attribute
	-Woverloaded-virtual -pedantic -Wno-long-long -Wno-variadic-macros
	-Wno-overlength-strings   -DHAVE_CONFIG_H -I. -I. -I../../gcc-7.1.1-20170622/gcc
	-I../../gcc-7.1.1-20170622/gcc/. -I../../gcc-7.1.1-20170622/gcc/../include
	-I../../gcc-7.1.1-20170622/gcc/../libcpp/include
	-I../../gcc-7.1.1-20170622/gcc/../libdecnumber
	-I../../gcc-7.1.1-20170622/gcc/../libdecnumber/dpd -I../libdecnumber
	-I../../gcc-7.1.1-20170622/gcc/../libbacktrace	 -o data-streamer-out.o
	-MT data-streamer-out.o -MMD -MP -MF ./.deps/data-streamer-out.TPo
	../../gcc-7.1.1-20170622/gcc/data-streamer-out.c
	g++ -fno-PIE -c   -pipe -frecord-gcc-switches -O2  -DIN_GCC  -DCROSS_DIRECTORY_STRUCTURE
	-fno-exceptions -fno-rtti -fasynchronous-unwind-tables -W -Wall
	-Wno-narrowing -Wwrite-strings -Wcast-qual -Wmissing-format-attribute
	-Woverloaded-virtual -pedantic -Wno-long-long -Wno-variadic-macros
	-Wno-overlength-strings   -DHAVE_CONFIG_H -I. -I. -I../../gcc-7.1.1-20170622/gcc
	-I../../gcc-7.1.1-20170622/gcc/. -I../../gcc-7.1.1-20170622/gcc/../include
	-I../../gcc-7.1.1-20170622/gcc/../libcpp/include
	-I../../gcc-7.1.1-20170622/gcc/../libdecnumber
	-I../../gcc-7.1.1-20170622/gcc/../libdecnumber/dpd -I../libdecnumber
	-I../../gcc-7.1.1-20170622/gcc/../libbacktrace	 -o dbxout.o -MT dbxout.o -MMD -MP -MF
	./.deps/dbxout.TPo ../../gcc-7.1.1-20170622/gcc/dbxout.c
	g++ -fno-PIE -c   -pipe -frecord-gcc-switches -O2  -DIN_GCC  -DCROSS_DIRECTORY_STRUCTURE
	-fno-exceptions -fno-rtti -fasynchronous-unwind-tables -W -Wall
	-Wno-narrowing -Wwrite-strings -Wcast-qual -Wmissing-format-attribute
	-Woverloaded-virtual -pedantic -Wno-long-long -Wno-variadic-macros
	-Wno-overlength-strings   -DHAVE_CONFIG_H -I. -I. -I../../gcc-7.1.1-20170622/gcc
	-I../../gcc-7.1.1-20170622/gcc/. -I../../gcc-7.1.1-20170622/gcc/../include
	-I../../gcc-7.1.1-20170622/gcc/../libcpp/include
	-I../../gcc-7.1.1-20170622/gcc/../libdecnumber
	-I../../gcc-7.1.1-20170622/gcc/../libdecnumber/dpd -I../libdecnumber
	-I../../gcc-7.1.1-20170622/gcc/../libbacktrace	 -o dbgcnt.o -MT dbgcnt.o -MMD -MP -MF
	./.deps/dbgcnt.TPo ../../gcc-7.1.1-20170622/gcc/dbgcnt.c
	g++ -fno-PIE -c   -pipe -frecord-gcc-switches -O2  -DIN_GCC  -DCROSS_DIRECTORY_STRUCTURE
	-fno-exceptions -fno-rtti -fasynchronous-unwind-tables -W -Wall
	-Wno-narrowing -Wwrite-strings -Wcast-qual -Wmissing-format-attribute
	-Woverloaded-virtual -pedantic -Wno-long-long -Wno-variadic-macros
	-Wno-overlength-strings   -DHAVE_CONFIG_H -I. -I. -I../../gcc-7.1.1-20170622/gcc
	-I../../gcc-7.1.1-20170622/gcc/. -I../../gcc-7.1.1-20170622/gcc/../include
	-I../../gcc-7.1.1-20170622/gcc/../libcpp/include
	-I../../gcc-7.1.1-20170622/gcc/../libdecnumber
	-I../../gcc-7.1.1-20170622/gcc/../libdecnumber/dpd -I../libdecnumber
	-I../../gcc-7.1.1-20170622/gcc/../libbacktrace	 -o dce.o -MT dce.o -MMD -MP -MF
	./.deps/dce.TPo ../../gcc-7.1.1-20170622/gcc/dce.c
	g++ -fno-PIE -c   -pipe -frecord-gcc-switches -O2  -DIN_GCC  -DCROSS_DIRECTORY_STRUCTURE
	-fno-exceptions -fno-rtti -fasynchronous-unwind-tables -W -Wall
	-Wno-narrowing -Wwrite-strings -Wcast-qual -Wmissing-format-attribute
	-Woverloaded-virtual -pedantic -Wno-long-long -Wno-variadic-macros
	-Wno-overlength-strings   -DHAVE_CONFIG_H -I. -I. -I../../gcc-7.1.1-20170622/gcc
	-I../../gcc-7.1.1-20170622/gcc/. -I../../gcc-7.1.1-20170622/gcc/../include
	-I../../gcc-7.1.1-20170622/gcc/../libcpp/include
	-I../../gcc-7.1.1-20170622/gcc/../libdecnumber
	-I../../gcc-7.1.1-20170622/gcc/../libdecnumber/dpd -I../libdecnumber
	-I../../gcc-7.1.1-20170622/gcc/../libbacktrace	 -o ddg.o -MT ddg.o -MMD -MP -MF
	./.deps/ddg.TPo ../../gcc-7.1.1-20170622/gcc/ddg.c
	g++ -fno-PIE -c   -pipe -frecord-gcc-switches -O2  -DIN_GCC  -DCROSS_DIRECTORY_STRUCTURE
	-fno-exceptions -fno-rtti -fasynchronous-unwind-tables -W -Wall
	-Wno-narrowing -Wwrite-strings -Wcast-qual -Wmissing-format-attribute
	-Woverloaded-virtual -pedantic -Wno-long-long -Wno-variadic-macros
	-Wno-overlength-strings   -DHAVE_CONFIG_H -I. -I. -I../../gcc-7.1.1-20170622/gcc
	-I../../gcc-7.1.1-20170622/gcc/. -I../../gcc-7.1.1-20170622/gcc/../include
	-I../../gcc-7.1.1-20170622/gcc/../libcpp/include
	-I../../gcc-7.1.1-20170622/gcc/../libdecnumber
	-I../../gcc-7.1.1-20170622/gcc/../libdecnumber/dpd -I../libdecnumber
	-I../../gcc-7.1.1-20170622/gcc/../libbacktrace	 -o debug.o -MT debug.o -MMD -MP -MF
	./.deps/debug.TPo ../../gcc-7.1.1-20170622/gcc/debug.c
	g++ -fno-PIE -c   -pipe -frecord-gcc-switches -O2  -DIN_GCC  -DCROSS_DIRECTORY_STRUCTURE
	-fno-exceptions -fno-rtti -fasynchronous-unwind-tables -W -Wall
	-Wno-narrowing -Wwrite-strings -Wcast-qual -Wmissing-format-attribute
	-Woverloaded-virtual -pedantic -Wno-long-long -Wno-variadic-macros
	-Wno-overlength-strings   -DHAVE_CONFIG_H -I. -I. -I../../gcc-7.1.1-20170622/gcc
	-I../../gcc-7.1.1-20170622/gcc/. -I../../gcc-7.1.1-20170622/gcc/../include
	-I../../gcc-7.1.1-20170622/gcc/../libcpp/include
	-I../../gcc-7.1.1-20170622/gcc/../libdecnumber
	-I../../gcc-7.1.1-20170622/gcc/../libdecnumber/dpd -I../libdecnumber
	-I../../gcc-7.1.1-20170622/gcc/../libbacktrace	 -o df-core.o -MT df-core.o -MMD -MP
	-MF ./.deps/df-core.TPo ../../gcc-7.1.1-20170622/gcc/df-core.c
	g++ -fno-PIE -c   -pipe -frecord-gcc-switches -O2  -DIN_GCC  -DCROSS_DIRECTORY_STRUCTURE
	-fno-exceptions -fno-rtti -fasynchronous-unwind-tables -W -Wall
	-Wno-narrowing -Wwrite-strings -Wcast-qual -Wmissing-format-attribute
	-Woverloaded-virtual -pedantic -Wno-long-long -Wno-variadic-macros
	-Wno-overlength-strings   -DHAVE_CONFIG_H -I. -I. -I../../gcc-7.1.1-20170622/gcc
	-I../../gcc-7.1.1-20170622/gcc/. -I../../gcc-7.1.1-20170622/gcc/../include
	-I../../gcc-7.1.1-20170622/gcc/../libcpp/include
	-I../../gcc-7.1.1-20170622/gcc/../libdecnumber
	-I../../gcc-7.1.1-20170622/gcc/../libdecnumber/dpd -I../libdecnumber
	-I../../gcc-7.1.1-20170622/gcc/../libbacktrace	 -o df-problems.o -MT df-problems.o
	-MMD -MP -MF ./.deps/df-problems.TPo ../../gcc-7.1.1-20170622/gcc/df-problems.c
	beehive: total build time limit (32400 seconds) exceeded

doublecmd-0.7.8-alt1
	Фатально: (1018) Компиляция прервана
	Error: /usr/bin/ppcx64 returned an error exitcode
	Error: (lazarus) Compile package cmdbox 0.0: stopped with exit code 256
	Error: (lazbuild) cmdbox 0.0 compilation failed

gawk-4.1.0-alt2
	make[2]: Entering directory '/usr/src/RPM/BUILD/gawk-4.1.0-alt2/test'
	1 TESTS FAILED
	make[2]: *** [Makefile:3646: pass-fail] Error 1
	--
	! made it here
	! ls: write error: Broken pipe
	! sh: 1: cart: not found

libclaw-1.7.4-alt1_15
	Verifying ELF objects in /usr/src/tmp/libclaw-buildroot
	(arch=normal,fhs=normal,lfs=relaxed,lint=relaxed,rpath=normal,stack=normal,textrel=normal,unresolved=normal)
	verify-elf: ERROR: ./usr/lib64/libclaw_application.so: undefined symbol:
	_ZN4claw11log_warningE
	verify-elf: ERROR: ./usr/lib64/libclaw_application.so: undefined symbol:
	_ZN4claw9log_errorE
	verify-elf: ERROR: ./usr/lib64/libclaw_application.so: undefined symbol: _ZN4claw6loggerE
	verify-elf: ERROR: ./usr/lib64/libclaw_application.so: undefined symbol:
	_ZTVN4claw14console_loggerE
	verify-elf: ERROR: ./usr/lib64/libclaw_application.so: undefined symbol:
	_ZN4claw11log_verboseE
	verify-elf: ERROR: ./usr/lib64/libclaw_application.so: undefined symbol:
	_ZN4claw10log_system5clearEv
	verify-elf: ERROR: ./usr/lib64/libclaw_application.so: undefined symbol:
	_ZN4claw18log_stream_conciseC1EPNS_10log_streamEm
	verify-elf: ERROR: ./usr/lib64/libclaw_application.so: undefined symbol:
	_ZN4claw10log_system9set_levelERKNS_9log_levelE
	verify-elf: ERROR: ./usr/lib64/libclaw_application.so: undefined symbol:
	_ZN4claw10log_system3setEPNS_10log_streamE
	verify-elf: ERROR: ./usr/lib64/libclaw_application.so: undefined symbol:
	_ZN4claw11file_loggerC1ERKNSt7__cxx1112basic_stringIcSt11char_traitsIcESaIcEEE

mpd-0.20.6-alt1
	src/archive/Iso9660ArchivePlugin.cxx: In member function 'void
	Iso9660ArchiveFile::Visit(const char*, ArchiveVisitor&)':
	src/archive/Iso9660ArchivePlugin.cxx:109:32: error: too few arguments to function
	'void _cdio_list_free(CdioList_t*, int, CdioDataFree_t)'
	_cdio_list_free (entlist, true);

python-module-radar-0.3-alt1.git20131211.1.1
	test_06_random_date_with_string_ranges_given (__main__.RadarTest) ... FAIL
	FAIL: test_06_random_date_with_string_ranges_given (__main__.RadarTest)
	Traceback (most recent call last):
	--
	self.assertTrue(res > dt_start)
	AssertionError: False is not true
	Ran 6 tests in 0.022s
	FAILED (failures=1)
	test_01_random_datetime

sgc-0.2.1-alt1
	pygame.display.init()
	error: Couldn't open X11 display
	The full traceback has been saved in /usr/src/tmp/sphinx-err-aPGfbs.log, if you want
	to report the issue to the developers.

snappy-java-1.1.2.4-alt2_8jpp8
	[INFO] ------------------------------------------------------------------------
	[ERROR] Failed to execute goal org.apache.maven.plugins:maven-antrun-plugin:1.8:run
	(compile) on project snappy-java: An Ant BuildException has occured: exec returned: 2
	[ERROR] around Ant part ...<exec failonerror="true" executable="make">... @ 7:46 in
	/usr/src/RPM/BUILD/snappy-java-1.1.2.4/target/antrun/build-main.xml
	[ERROR] -> [Help 1]
	[ERROR]
	[ERROR] To see the full stack trace of the errors, re-run Maven with the -e switch.
	[ERROR] Re-run Maven using the -X switch to enable full debug logging.
	[ERROR]
	[ERROR] For more information about the errors and possible solutions, please read the
	following articles:
	[ERROR] [Help 1] http://cwiki.apache.org/confluence/display/MAVEN/MojoExecutionException

transgui-5.0.1-alt3
	Целевая ОС: Linux for x86-64
	Компиляция transgui.lpr
	Компиляция baseform.pas
	Компиляция vargrid.pas
	Компиляция varlist.pas
	vargrid.pas(543,7) Ошибка: Идентификатоp "UTF8UpperCase" не
	найден
	vargrid.pas(549,10) Ошибка: Идентификатоp "UTF8UpperCase" не
	найден
	vargrid.pas(1460) Фатально: Пpи компиляции модyля
	произошло 2 ошибок, работа прервана
	make: *** [Makefile:1932: transgui] Error 1
	make: Leaving directory '/usr/src/RPM/BUILD/transgui-5.0.1/TransGUI'

winff-1.5.5-alt1
	Фатально: (1018) Компиляция прервана
	Error: /usr/bin/ppcx64 returned an error exitcode
	Error: (lazarus) Compile Project, Target: winff: stopped with exit code 256
	Error: (lazbuild) failed compiling of project
	/usr/src/RPM/BUILD/winff-1.5.5-source/winff.lpi

	14 error logs REMOVED from the list
alterator-wizardface-2.1-alt2
ants-0.5.3-alt4
apache2-mod_mono-3.12-alt2
clanlib0.8-0.8.1-alt5
collection4-4.0.0-alt1.git20130220
corners-1.4.3-alt1
kmymoney-4.8.1-alt1
libpqxx-1:4.0.1-alt1_10
libtorrent19-3:0.13.6-alt1
perl-IO-Event-0.813-alt2
pve-qemu-2.9.1-alt4.1
python-module-icu-1.9.2-alt1.1
sendmail-8.15.2-alt4
squid-3.5.26-alt2

Total 422 error logs.


Sisyphus-cybertalk