[cyber] I: Sisyphus-20170821 x86_64 beehive_status: +9 -23 (932)
ALT beekeeper
hiver на altlinux.org
Пн Авг 21 14:29:12 MSK 2017
9 NEW error logs
gst-plugins-bad1.0-1.12.2-alt2
from gstopenjpegdec.c:27:
gstopenjpeg.h:42:37: fatal error: openjpeg-2.1/openjpeg.h: No such file or directory
# include <openjpeg-2.1/openjpeg.h>
kde5-ktp-contact-runner-17.04.2-alt1.S1
/usr/lib64/cmake/KF5Runner/KF5RunnerConfig.cmake (version 5.37.0)
Reason given by package: KF5Runner could not be found because dependency KF5Plasma
could not be found.
CMake Error at /usr/share/CMake/Modules/FindPackageHandleStandardArgs.cmake:148 (message):
Could NOT find KF5 (missing: Runner) (found version "5.37.0")
Call Stack (most recent call first):
/usr/share/CMake/Modules/FindPackageHandleStandardArgs.cmake:388 (_FPHSA_FAILURE_MESSAGE)
/usr/share/ECM/find-modules/FindKF5.cmake:110 (find_package_handle_standard_args)
CMakeLists.txt:22 (find_package)
-- Configuring incomplete, errors occurred!
See also "/usr/src/RPM/BUILD/ktp-contact-runner-17.04.2/BUILD/CMakeFiles/CMakeOutput.log".
kde5-marble-17.04.2-alt1.S1
+ mv /usr/src/tmp/kde5-marble-buildroot//usr/share/marble
/usr/src/tmp/kde5-marble-buildroot//usr/share/kf5
mv: cannot stat '/usr/src/tmp/kde5-marble-buildroot//usr/share/marble': No such file
or directory
+ shift
--
Processing files: kde5-marble-17.04.2-alt1.S1
error: File not found by glob:
/usr/src/tmp/kde5-marble-buildroot/usr/share/kf5/plasma/*/org.kde.plasma.*world*
error: File not found: /usr/src/tmp/kde5-marble-buildroot/usr/lib64/qt5/qml/org/kde/marble
error: File not found by glob:
/usr/src/tmp/kde5-marble-buildroot/usr/share/kservices5/*world*.desktop
RPM build errors:
kde5-plasma-applet-places-widget-1.1-alt2.S1
Found package configuration file:
/usr/lib64/cmake/KF5Plasma/KF5PlasmaConfig.cmake
but it set KF5Plasma_FOUND to FALSE so package "KF5Plasma" is considered to
be NOT FOUND. Reason given by package:
KF5Plasma could not be found because dependency KF5WindowSystem could not
be found.
CMake Error at CMakeLists.txt:8 (plasma_install_package):
Unknown CMake command "plasma_install_package".
-- Configuring incomplete, errors occurred!
See also
"/usr/src/RPM/BUILD/plasma-applet-places-widget-1.1/BUILD/CMakeFiles/CMakeOutput.log".
kf5-milou-5.10.4-alt1.S1
Reason given by package: KF5Runner could not be found because dependency KF5Plasma
could not be found.
CMake Error at /usr/share/CMake/Modules/FindPackageHandleStandardArgs.cmake:148 (message):
Could NOT find KF5 (missing: Plasma Runner) (found suitable version
"5.37.0", minimum required is "5.24.0")
Call Stack (most recent call first):
/usr/share/CMake/Modules/FindPackageHandleStandardArgs.cmake:388 (_FPHSA_FAILURE_MESSAGE)
/usr/share/ECM/find-modules/FindKF5.cmake:110 (find_package_handle_standard_args)
CMakeLists.txt:13 (find_package)
-- Configuring incomplete, errors occurred!
See also "/usr/src/RPM/BUILD/milou-5.10.4/BUILD/CMakeFiles/CMakeOutput.log".
kf5-plasma-mediacenter-5.7.4-alt1
-- Found KF5PlasmaQuick: /usr/lib64/cmake/KF5PlasmaQuick/KF5PlasmaQuickConfig.cmake
(found version "5.37.0")
CMake Error at /usr/share/CMake/Modules/FindPackageHandleStandardArgs.cmake:148 (message):
Could NOT find KF5 (missing: Plasma) (found suitable version "5.37.0",
minimum required is "5.5.0")
Call Stack (most recent call first):
/usr/share/CMake/Modules/FindPackageHandleStandardArgs.cmake:388 (_FPHSA_FAILURE_MESSAGE)
/usr/share/ECM/find-modules/FindKF5.cmake:110 (find_package_handle_standard_args)
CMakeLists.txt:47 (find_package)
-- Configuring incomplete, errors occurred!
See also "/usr/src/RPM/BUILD/plasma-mediacenter-5.7.4/BUILD/CMakeFiles/CMakeOutput.log".
kf5-plasma-pa-5.10.4-alt1.S1
-- Found gconf-2.0, version 3.2.6
Package dbus-1 was not found in the pkg-config search path.
Perhaps you should add the directory containing `dbus-1.pc'
to the PKG_CONFIG_PATH environment variable
Package 'dbus-1', required by 'gconf', not found
Package dbus-1 was not found in the pkg-config search path.
Perhaps you should add the directory containing `dbus-1.pc'
to the PKG_CONFIG_PATH environment variable
Package 'dbus-1', required by 'gconf', not found
Package dbus-1 was not found in the pkg-config search path.
Perhaps you should add the directory containing `dbus-1.pc'
to the PKG_CONFIG_PATH environment variable
Package 'dbus-1', required by 'gconf', not found
-- Checking for module 'gobject-2.0'
perl-Net-Ping-2.61-alt1
t/150_syn_inst.t ...... ok
# Failed test 'Make sure it died for a good excuse'
# at t/190_alarm.t line 51.
--
t/190_alarm.t (Wstat: 256 Tests: 6 Failed: 1)
Failed test: 6
Non-zero exit status: 1
--
Result: FAIL
Failed 1/16 test programs. 1/67 subtests failed.
make: *** [test_dynamic] Error 255
plasma-applet-thermal-monitor-1.2.7-alt1
Found package configuration file:
/usr/lib64/cmake/KF5Plasma/KF5PlasmaConfig.cmake
but it set KF5Plasma_FOUND to FALSE so package "KF5Plasma" is considered to
be NOT FOUND. Reason given by package:
KF5Plasma could not be found because dependency KF5WindowSystem could not
be found.
CMake Error at CMakeLists.txt:17 (plasma_install_package):
Unknown CMake command "plasma_install_package".
-- Configuring incomplete, errors occurred!
See also
"/usr/src/RPM/BUILD/plasma-applet-thermal-monitor-1.2.7/BUILD/CMakeFiles/CMakeOutput.log".
23 error logs REMOVED from the list
libtuxcap-1.4.0-alt2.cvs20091223.1
perl-Dancer2-0.166001-alt1
perl-HTML-Widget-1.11-alt2
perl-HTML-WikiConverter-MoinMoin-0.54-alt1.1
perl-IO-Async-0.69-alt1
perl-IO-Event-0.813-alt2
perl-ORLite-1.98-alt1
perl-POE-API-Peek-2.20-alt1
perl-Time-Format_XS-1.03-alt3.1.1.1
python-module-Naked-1.0.29-alt2.git20140316.1.1.1
python-module-OpenGL_accelerate-3.1.0-alt2.1.1
python-module-affinegap-1.10-alt1
python-module-asa-0.4-alt2.1.1
python-module-dataflake.fakeldap-1.2-alt2.dev.git20121018.1
python-module-dedupe-hcluster-0.3.2-alt1.git20150304.1.1
python-module-fiona-1.6.0-alt1.git20150810.1.1
python-module-gevent-loops-0.0.2-alt1.1
python-module-http-parser-0.8.3-alt1.git20150514.1.2
python-module-joblib-0.11-alt1
python-module-pandas-0.20.2-alt2
python-module-pyvows-2.0.6-alt1.git20141008
python-module-scikits.sparse-0.2-alt2.dev.git20140718.1.2
python-module-triangle-2013.04.05-alt1.git20141030.1.1
Total 932 error logs.
Подробная информация о списке рассылки Sisyphus-cybertalk