[cyber] I: Sisyphus-20161101 x86_64 beehive_status: +3 -2 (473)
ALT beekeeper
hiver на altlinux.org
Вт Ноя 1 13:28:58 MSK 2016
3 NEW error logs
0ad-1:0.0.20-alt1
verify-elf: WARNING: ./usr/lib64/0ad/libCollada.so: RPATH entry found: /usr/lib64/0ad
verify-elf: ERROR: ./usr/bin/pyrogenesis: not found: libmozjs31-ps-release.so
verify-elf: ERROR: ./usr/bin/pyrogenesis: not found: libnvtt.so
verify-elf: ERROR: ./usr/bin/pyrogenesis: undefined symbol:
_ZN4nvtt18CompressionOptionsD1Ev
verify-elf: ERROR: ./usr/bin/pyrogenesis: undefined symbol:
_ZN4nvtt12InputOptions16setTextureLayoutENS_11TextureTypeEiii
verify-elf: ERROR: ./usr/bin/pyrogenesis: undefined symbol:
_ZN4nvtt12InputOptions11setWrapModeENS_8WrapModeE
verify-elf: ERROR: ./usr/bin/pyrogenesis: undefined symbol:
_ZN4nvtt12InputOptions15setMipmapFilterENS_12MipmapFilterE
verify-elf: ERROR: ./usr/bin/pyrogenesis: undefined symbol: _ZN4nvtt10CompressorD1Ev
verify-elf: ERROR: ./usr/bin/pyrogenesis: undefined symbol: _ZN4nvtt12InputOptionsC1Ev
verify-elf: ERROR: ./usr/bin/pyrogenesis: undefined symbol:
_ZN4nvtt13OutputOptions16setOutputHandlerEPNS_13OutputHandlerE
verify-elf: ERROR: ./usr/bin/pyrogenesis: undefined symbol:
_ZN4nvtt18CompressionOptionsC1Ev
python-module-terminado-0.5-alt1.git20150717.1
terminado/tests/basic_test.py::SingleTermTests::test_single_process <-
../../../../lib64/python2.7/site-packages/tornado/testing.py PASSED
terminado/tests/basic_test.py::UniqueTermTests::test_max_terminals <-
../../../../lib64/python2.7/site-packages/tornado/testing.py FAILED
terminado/tests/basic_test.py::UniqueTermTests::test_unique_processes <-
../../../../lib64/python2.7/site-packages/tornado/testing.py PASSED
--
> self.assertEquals(msg[0], 'setup')
E TypeError: 'NoneType' object has no attribute '__getitem__'
terminado/tests/basic_test.py:233: TypeError
--
WARNING:tornado.general:tornado.autoreload started more than once in the same process
ERROR:tornado.application:Uncaught exception in /unique
Traceback (most recent call last):
--
MaxTerminalsReached: Cannot create more than 3 terminals
ERROR:tornado.application:Uncaught exception in /unique
Traceback (most recent call last):
rxjava-1.0.13-alt1_1jpp8
Results :
Failed tests:
OperatorSerializeTest.testMultiThreadedWithNPE:116 null
2 error logs REMOVED from the list
pam_pkcs11-0.6.8-alt1.git20140828
perl-Convert-PEM-0.08-alt1
Total 473 error logs.
Подробная информация о списке рассылки Sisyphus-cybertalk