[riscv-reports] [#139928] [test-only] sisyphus_riscv64 FAILED (try 7) srpm=rust-1.98.1-alt1.src.rpm srpm=fd-10.5.0-alt1.src.rpm ...

Girar sisyphus_riscv64 awaiter iv noreply at basealt.ru
Thu Sep 17 19:22:53 MSK 2026


http://web.build.srt.basealt.ru/tasks/139928/logs/events.7.1.log

subtask  name     riscv64
   #600  firefox   failed

2026-Sep-17 16:02:51 :: test-only shared task #139928 for sisyphus_riscv64 resumed by iv:
2026-Sep-17 16:02:51 :: message: sync
#100 build rust-1.98.1-alt1.src.rpm
#200 build fd-10.5.0-alt1.src.rpm from sisyphus_riscv64
#300 removed
#400 removed
#500 removed
#600 build 152.0.4-alt0.port from /gears/f/firefox.git fetched at 2026-Sep-17 14:46:59 from sisyphus_riscv64
2026-Sep-17 16:02:51 :: created build repo
2026-Sep-17 16:03:02 :: [riscv64] #100 rust-1.98.1-alt1.src.rpm: build start
2026-Sep-17 16:03:17 :: [riscv64] #100 rust-1.98.1-alt1.src.rpm: build swiftly SKIPPED
2026-Sep-17 16:03:17 :: [riscv64] #200 fd-10.5.0-alt1.src.rpm: build start
2026-Sep-17 16:03:20 :: [riscv64] #200 fd-10.5.0-alt1.src.rpm: build swiftly SKIPPED
2026-Sep-17 16:03:20 :: [riscv64] #600 firefox.git 152.0.4-alt0.port: build start
[riscv64]  0:39.64 checking for rust host triplet...
[riscv64]  0:39.64 E ERROR: The rust compiler host (riscv64gc-unknown-linux-gnu) is not suitable for the configure host (riscv64-unknown-linux-gnu/riscv64-oe-linux-gnu).
[riscv64]  0:39.64 To resolve this, install and select a Rust toolchain for riscv64-oe-linux-gnu:
2026-Sep-17 16:22:52 :: [riscv64] firefox.git 152.0.4-alt0.port: remote: build failed
2026-Sep-17 16:22:52 :: [riscv64] #600 firefox.git 152.0.4-alt0.port: build FAILED
2026-Sep-17 16:22:52 :: [riscv64] requesting cancellation of task processing
2026-Sep-17 16:22:53 :: [riscv64] build FAILED
2026-Sep-17 16:22:53 :: task #139928 for sisyphus_riscv64 FAILED


More information about the Riscv-reports mailing list